RESNUM,RESNAME,H_X,H_Y,H_BEST_REF_SCORE,H_BEST_REF_COV,H_BEST_REF_MATCH,H_UCBShift,HA_X,HA_Y,HA_BEST_REF_SCORE,HA_BEST_REF_COV,HA_BEST_REF_MATCH,HA_UCBShift,C_X,C_Y,C_BEST_REF_SCORE,C_BEST_REF_COV,C_BEST_REF_MATCH,C_UCBShift,CA_X,CA_Y,CA_BEST_REF_SCORE,CA_BEST_REF_COV,CA_BEST_REF_MATCH,CA_UCBShift,CB_X,CB_Y,CB_BEST_REF_SCORE,CB_BEST_REF_COV,CB_BEST_REF_MATCH,CB_UCBShift,N_X,N_Y,N_BEST_REF_SCORE,N_BEST_REF_COV,N_BEST_REF_MATCH,N_UCBShift
1,SER,8.395202685908536,,0.0,0.0,0,8.395202685908536,4.464204159490509,,0.0,0.0,0,4.464204159490509,174.76970502280497,,0.0,0.0,0,174.76970502280497,58.01093923608058,,0.0,0.0,0,58.01093923608058,63.93246109741924,,0.0,0.0,0,63.93246109741924,116.28248058130758,,0.0,0.0,0,116.28248058130758
2,THR,8.36242754831835,,0.0,0.0,0,8.36242754831835,4.4405465751998,,0.0,0.0,0,4.4405465751998,175.11026299798533,,0.0,0.0,0,175.11026299798533,61.670184516605616,,0.0,0.0,0,61.670184516605616,69.3856215462038,,0.0,0.0,0,69.3856215462038,115.81879085992895,,0.0,0.0,0,115.81879085992895
3,GLY,7.997979750749252,8.21,0.5200009151377173,0.7395833333333334,1,8.150811987640138,4.086345820182595,,0.0,0.0,0,4.086345820182595,172.4185515582029,,0.0,0.0,0,172.4185515582029,44.45259773438229,44.63,0.5200009151377173,0.7395833333333334,1,44.5395695538961,,,0.0,0.0,0,,110.89791656219336,110.46,0.5200009151377173,0.7395833333333334,1,110.51696018972139
4,PRO,,,0.0,0.0,0,,4.447282447463648,4.63,0.5200009151377173,0.7395833333333334,1,4.643383338505939,176.345335156438,176.49,0.5200009151377173,0.7395833333333334,1,176.514457386014,63.42709925270285,63.38,0.5200009151377173,0.7395833333333334,1,63.396844060550556,32.20971717488623,32.68,0.5200009151377173,0.7395833333333334,1,32.579693666594515,,,0.0,0.0,0,
5,ARG,8.710791841347541,9.07,0.5200009151377173,0.7395833333333334,1,9.105133795027195,4.661439878621379,4.65,0.5200009151377173,0.7395833333333334,1,4.652222358280609,175.2849524840826,174.12,0.5200009151377173,0.7395833333333334,1,174.25423231392497,55.00096760248085,54.95,0.5200009151377173,0.7395833333333334,1,54.96471759136419,31.892491612914863,32.68,0.5200009151377173,0.7395833333333334,1,32.65088147072927,122.59520766614497,123.68,0.5200009151377173,0.7395833333333334,1,123.80963129150294
6,ALA,8.9051329499556,8.71,0.5200009151377173,0.7395833333333334,1,8.70558984962815,3.64076395482018,2.94,0.5200009151377173,0.7395833333333334,1,3.0229020838217346,176.75823224875126,176.49,0.5200009151377173,0.7395833333333334,1,176.7253012415196,52.75121466620047,52.6,0.5200009151377173,0.7395833333333334,1,52.60622472923743,18.03627688620824,17.77,0.5200009151377173,0.7395833333333334,1,17.872947581440783,128.99104559428903,129.64,0.5200009151377173,0.7395833333333334,1,129.78494279451658
7,LEU,8.845100752081251,8.68,0.5200009151377173,0.7395833333333334,1,8.704956211427461,4.426316751753802,4.44,0.5200009151377173,0.7395833333333334,1,4.446981921617272,177.56945861832057,177.39,0.5200009151377173,0.7395833333333334,1,177.51099396034522,55.856365972915974,55.42,0.5200009151377173,0.7395833333333334,1,55.527442775185925,42.95995111118881,43.46,0.5200009151377173,0.7395833333333334,1,43.49806914292374,123.99750996872017,122.07,0.5200009151377173,0.7395833333333334,1,122.60190456032856
8,SER,8.038783643373293,7.92,0.5200009151377173,0.7395833333333334,1,7.9981139987234995,4.418611874220224,4.29,0.5200009151377173,0.7395833333333334,1,4.312216666966367,172.90319120676546,,0.0,0.0,0,172.90319120676546,57.56879251265401,57.56,0.5200009151377173,0.7395833333333334,1,57.55659825785325,64.42959722334332,63.86,0.5200009151377173,0.7395833333333334,1,64.19685938646909,113.28797262959263,112.12,0.5200009151377173,0.7395833333333334,1,112.67513327713398
9,ARG,8.475637295748697,,0.0,0.0,0,8.475637295748697,3.605048363439338,3.67,0.5200009151377173,0.7395833333333334,1,3.627623973215673,174.80272898498168,175.09,0.5200009151377173,0.7395833333333334,1,175.23669721372517,54.61360714447774,54.01,0.5200009151377173,0.7395833333333334,1,54.069346549728046,30.63497494973915,30.81,0.5200009151377173,0.7395833333333334,1,30.870534674969473,125.79175248004218,,0.0,0.0,0,125.79175248004218
10,ASN,8.233856853951604,8.07,0.5200009151377173,0.7395833333333334,1,8.096298037656789,4.652904538100788,4.41,0.5200009151377173,0.7395833333333334,1,4.452765362809413,175.9150106134421,175.28,0.5200009151377173,0.7395833333333334,1,175.2673675658175,53.74886119911755,54.01,0.5200009151377173,0.7395833333333334,1,54.08109216969142,38.8939171486569,38.07,0.5200009151377173,0.7395833333333334,1,38.132165627755576,120.21258618977134,120.11,0.5200009151377173,0.7395833333333334,1,120.2394467053724
11,GLN,8.577175054512153,8.83,0.5200009151377173,0.7395833333333334,1,8.828426736396935,4.469046040759241,4.23,0.5200009151377173,0.7395833333333334,1,4.2918554162337665,174.49456398323898,174.66,0.5200009151377173,0.7395833333333334,1,174.62948353789545,54.4406248466145,54.24,0.5200009151377173,0.7395833333333334,1,54.25918640069375,28.133904162864912,27.52,0.5200009151377173,0.7395833333333334,1,27.663669410811412,123.28665379533244,121.82,0.5200009151377173,0.7395833333333334,1,122.19960219184149
12,PRO,,,0.0,0.0,0,,4.45929120028305,4.49,0.5200009151377173,0.7395833333333334,1,4.494209040603841,175.8028899497447,174.81,0.5200009151377173,0.7395833333333334,1,174.9813490327395,62.44608086828727,62.21,0.5200009151377173,0.7395833333333334,1,62.262724605905206,32.10716930838606,31.74,0.5200009151377173,0.7395833333333334,1,31.778848760916862,,,0.0,0.0,0,
13,GLN,8.559070523759575,8.72,0.5200009151377173,0.7395833333333334,1,8.749728151809302,4.292384031729382,4.24,0.5200009151377173,0.7395833333333334,1,4.28070518040848,175.48939556668333,173.92,0.5200009151377173,0.7395833333333334,1,174.08102221304807,55.614003065323566,55.42,0.5200009151377173,0.7395833333333334,1,55.51589626542902,29.13431676127761,29.4,0.5200009151377173,0.7395833333333334,1,29.39554667166167,120.97388301209345,121.65,0.5200009151377173,0.7395833333333334,1,121.70458156110556
14,TYR,8.687672155472304,8.69,0.5200009151377173,0.7395833333333334,1,8.701045022854922,4.620060366178266,4.83,0.5200009151377173,0.7395833333333334,1,4.7738087872183375,175.0000628769453,175.17,0.5200009151377173,0.7395833333333334,1,175.22573671206572,56.696550800316345,55.38,0.5200009151377173,0.7395833333333334,1,55.535094698040844,39.03434726140526,39.72,0.5200009151377173,0.7395833333333334,1,39.693834275102674,124.42870463638585,125.82,0.5200009151377173,0.7395833333333334,1,125.957137414208
15,PRO,,,0.0,0.0,0,,4.4678574396020645,4.43,0.5200009151377173,0.7395833333333334,1,4.4292392609612605,177.23504072972028,177.36,0.5200009151377173,0.7395833333333334,1,177.44170354099234,62.94393620640471,63.15,0.5200009151377173,0.7395833333333334,1,63.024153629353975,32.502097135192585,32.21,0.5200009151377173,0.7395833333333334,1,32.407185840182045,,,0.0,0.0,0,
16,ALA,8.818687769363969,8.85,0.5200009151377173,0.7395833333333334,1,8.876228587795538,4.059913011288711,4.18,0.5200009151377173,0.7395833333333334,1,4.173872504945055,179.8832904854146,180.7,0.5200009151377173,0.7395833333333334,1,180.71088666920858,56.709460144660895,55.42,0.5200009151377173,0.7395833333333334,1,55.73376800914085,18.13895271848707,18.39,0.5200009151377173,0.7395833333333334,1,18.495497525213676,128.79453763779554,128.15,0.5200009151377173,0.7395833333333334,1,128.52304681032302
17,ARG,8.670020537823287,8.93,0.5200009151377173,0.7395833333333334,1,8.869191098840048,4.123694370923521,4.14,0.5200009151377173,0.7395833333333334,1,4.140814445715396,178.26862538347766,177.33,0.5200009151377173,0.7395833333333334,1,177.54236812971473,58.692051556721054,58.46,0.5200009151377173,0.7395833333333334,1,58.67024904769675,29.83626986147186,29.63,0.5200009151377173,0.7395833333333334,1,29.651090295537795,118.53597568733488,117.36,0.5200009151377173,0.7395833333333334,1,117.78248320458985
18,ALA,7.870531007664558,6.99,0.5200009151377173,0.7395833333333334,1,7.081613975951826,3.9610975100677104,4.12,0.5200009151377173,0.7395833333333334,1,4.093802008691309,179.38177421749918,178.97,0.5200009151377173,0.7395833333333334,1,179.05078824126986,54.7192926464924,54.01,0.5200009151377173,0.7395833333333334,1,54.22767033230658,18.60925904865135,19.32,0.5200009151377173,0.7395833333333334,1,18.996751780547232,122.8895504031746,119.04,0.5200009151377173,0.7395833333333334,1,119.68924481267067
19,GLN,8.553810552214452,8.04,0.5200009151377173,0.7395833333333334,1,8.220403696081696,3.959962525219225,4.01,0.5200009151377173,0.7395833333333334,1,4.016966713353313,178.5056527871351,178.67,0.5200009151377173,0.7395833333333334,1,178.58564301717172,59.017579251476306,58.68,0.5200009151377173,0.7395833333333334,1,58.819886113025866,28.815132577777778,28.46,0.5200009151377173,0.7395833333333334,1,28.6111515513431,119.73153261649462,118.58,0.5200009151377173,0.7395833333333334,1,118.94265176485182
20,ALA,8.088108133411033,8.0,0.5200009151377173,0.7395833333333334,1,8.05466647952048,4.209535201931402,4.16,0.5200009151377173,0.7395833333333334,1,4.159382963863914,179.4285026620435,178.98,0.5200009151377173,0.7395833333333334,1,179.0956808410645,54.663125614257964,54.24,0.5200009151377173,0.7395833333333334,1,54.42065685470641,17.61311770466756,18.38,0.5200009151377173,0.7395833333333334,1,18.40892690753136,122.79491282766678,120.7,0.5200009151377173,0.7395833333333334,1,121.21293048451548
21,LEU,7.613636768770119,7.46,0.5200009151377173,0.7395833333333334,1,7.506348320868021,4.319225676842602,4.29,0.5200009151377173,0.7395833333333334,1,4.28427007942613,176.1302696740648,176.07,0.5200009151377173,0.7395833333333334,1,176.17492675412365,54.95520071952492,54.95,0.5200009151377173,0.7395833333333334,1,54.92806911275391,42.61599905054945,42.99,0.5200009151377173,0.7395833333333334,1,42.900858733294484,116.13000609452214,116.24,0.5200009151377173,0.7395833333333334,1,116.56833343708513
22,ARG,7.9246339283494285,7.91,0.5200009151377173,0.7395833333333334,1,7.912034973176824,4.063062802719503,4.05,0.5200009151377173,0.7395833333333334,1,4.057796142457542,175.38599696763237,174.54,0.5200009151377173,0.7395833333333334,1,174.6541257904429,56.9889086543179,56.82,0.5200009151377173,0.7395833333333334,1,56.82329779501055,26.94084652107892,27.29,0.5200009151377173,0.7395833333333334,1,27.394602907215003,117.16304759610945,117.37,0.5200009151377173,0.7395833333333334,1,117.57138256035077
23,ILE,8.206825879542679,7.95,0.5200009151377173,0.7395833333333334,1,8.02862260910756,4.2123396344350095,4.42,0.5200009151377173,0.7395833333333334,1,4.39311407051282,175.53838530585526,175.35,0.5200009151377173,0.7395833333333334,1,175.45432256026197,60.84686457874903,60.34,0.5200009151377173,0.7395833333333334,1,60.42649831694417,38.64897597808858,40.65,0.5200009151377173,0.7395833333333334,1,40.39804430114885,120.13798238064713,117.09,0.5200009151377173,0.7395833333333334,1,117.55374987950938
24,GLU,8.561495777428128,8.33,0.5200009151377173,0.7395833333333334,1,8.355677123859474,4.5574310651154395,4.82,0.5200009151377173,0.7395833333333334,1,4.797277928182928,175.93025372419245,175.54,0.5200009151377173,0.7395833333333334,1,175.72269423165721,56.63195896409702,54.81,0.5200009151377173,0.7395833333333334,1,55.17398068234543,31.335808025302477,31.98,0.5200009151377173,0.7395833333333334,1,32.00917293024753,125.7338985912199,124.88,0.5200009151377173,0.7395833333333334,1,125.18866849819071
25,GLY,8.410102592718392,8.83,0.5200009151377173,0.7395833333333334,1,8.816002292202242,4.061282701132201,,0.0,0.0,0,4.061282701132201,171.8777500981907,172.47,0.5200009151377173,0.7395833333333334,1,172.47827050870242,45.60325964953935,45.81,0.5200009151377173,0.7395833333333334,1,45.96559193242869,,,0.0,0.0,0,,107.61551474667,107.6,0.5200009151377173,0.7395833333333334,1,107.90534311862027
26,ARG,8.964964274941726,8.59,0.5200009151377173,0.7395833333333334,0,8.64140616890332,5.2406642944000446,5.46,0.5200009151377173,0.7395833333333334,0,5.45538553882229,174.43399820967923,175.15,0.5200009151377173,0.7395833333333334,0,175.13696592943725,53.984635065806415,55.48,0.5200009151377173,0.7395833333333334,0,55.196047287207236,34.19057581194361,33.95,0.5200009151377173,0.7395833333333334,0,34.12975367034632,119.07614837544678,118.7,0.5200009151377173,0.7395833333333334,0,118.45671823098569
27,VAL,9.237213972671773,9.38,0.5200009151377173,0.7395833333333334,1,9.374654669197469,4.920676512604062,4.93,0.5200009151377173,0.7395833333333334,1,4.9790667940226445,173.99614686351427,172.76,0.5200009151377173,0.7395833333333334,1,172.83497671573429,60.778946256487956,61.04,0.5200009151377173,0.7395833333333334,1,60.991236594250196,35.23538844955045,35.96,0.5200009151377173,0.7395833333333334,1,36.08005266077256,122.3775083080808,125.1,0.5200009151377173,0.7395833333333334,1,125.05404468725719
28,LYS,9.034962834421133,9.16,0.5200009151377173,0.7395833333333334,1,9.186553736413586,5.1802006418303925,5.42,0.5200009151377173,0.7395833333333334,1,5.389916721572872,175.53432848263404,175.69,0.5200009151377173,0.7395833333333334,1,175.85128387728938,55.446397512481965,55.42,0.5200009151377173,0.7395833333333334,1,55.42853962253857,34.647172226800976,34.38,0.5200009151377173,0.7395833333333334,1,34.44472105470086,128.57874100909646,129.99,0.5200009151377173,0.7395833333333334,1,130.31925226509046
29,VAL,9.235782984704183,9.33,0.5200009151377173,0.7395833333333334,1,9.342710747052948,4.974093574170274,5.1,0.5200009151377173,0.7395833333333334,1,5.083683244089244,173.3039521370796,171.99,0.5200009151377173,0.7395833333333334,1,172.18193509703076,60.37452961138307,60.1,0.5200009151377173,0.7395833333333334,1,60.14740751825952,35.017908122033525,35.96,0.5200009151377173,0.7395833333333334,1,35.95751386984127,126.40248191884781,125.31,0.5200009151377173,0.7395833333333334,1,125.97302096233766
30,LYS,8.906349441935841,9.06,0.5200009151377173,0.7395833333333334,1,9.076448175091574,5.473106812853812,5.96,0.5200009151377173,0.7395833333333334,1,5.863639357692309,175.76807778838938,174.48,0.5200009151377173,0.7395833333333334,1,174.6328904037518,54.36127252133977,53.54,0.5200009151377173,0.7395833333333334,1,53.56006884688645,35.313327053335556,37.13,0.5200009151377173,0.7395833333333334,1,36.932218271539575,126.85155640139861,126.09,0.5200009151377173,0.7395833333333334,1,126.41314450044956
31,PHE,9.075682952547455,9.1,0.5200009151377173,0.7395833333333334,1,9.193193708424909,5.159297658014207,5.15,0.5200009151377173,0.7395833333333334,1,5.134503156393606,171.79582177897103,171.31,0.5200009151377173,0.7395833333333334,1,171.51278235972362,56.279419919552666,56.35,0.5200009151377173,0.7395833333333334,1,56.42554235327451,41.205672110672666,40.88,0.5200009151377173,0.7395833333333334,1,41.00412210453436,122.71566907694528,121.5,0.5200009151377173,0.7395833333333334,1,121.81557858000333
32,ASP,9.086738767127317,8.8,0.5200009151377173,0.7395833333333334,1,8.857175469147519,5.343594747191697,5.22,0.5200009151377173,0.7395833333333334,1,5.28309133019758,175.50138039241315,174.73,0.5200009151377173,0.7395833333333334,1,174.83403796318126,52.65483523968809,52.14,0.5200009151377173,0.7395833333333334,1,52.27839314397824,43.637706372582976,43.23,0.5200009151377173,0.7395833333333334,1,43.32121373979909,119.08564670320791,116.64,0.5200009151377173,0.7395833333333334,1,117.19783955166501
33,VAL,8.972575066278166,8.76,0.5200009151377173,0.7395833333333334,1,8.799116402086801,4.922565148640249,4.95,0.5200009151377173,0.7395833333333334,1,4.98942106961927,176.774133189899,177.68,0.5200009151377173,0.7395833333333334,1,177.60764564019314,60.804619653779554,61.04,0.5200009151377173,0.7395833333333334,1,61.04246590572761,33.561357332373184,34.09,0.5200009151377173,0.7395833333333334,1,34.29355388620269,120.94814295930736,120.12,0.5200009151377173,0.7395833333333334,1,120.48265377664003
34,THR,8.839484888011988,9.39,0.5200009151377173,0.7395833333333334,1,9.47199507815518,4.641843446414696,4.8,0.5200009151377173,0.7395833333333334,1,4.804496243023642,176.88064158630812,,0.0,0.0,0,176.88064158630812,60.9024192017538,62.1,0.5200009151377173,0.7395833333333334,1,61.789041950732596,71.23384051511822,68.02,0.5200009151377173,0.7395833333333334,1,68.48321782780553,117.71778655352425,117.19,0.5200009151377173,0.7395833333333334,1,117.69128481045621
35,SER,8.84845005982906,,0.0,0.0,0,8.84845005982906,4.21867777967588,,0.0,0.0,0,4.21867777967588,175.48229553252304,,0.0,0.0,0,175.48229553252304,60.837683745959595,,0.0,0.0,0,60.837683745959595,63.0296117978022,,0.0,0.0,0,63.0296117978022,116.80284412263848,,0.0,0.0,0,116.80284412263848
36,ALA,7.870837874630925,,0.0,0.0,0,7.870837874630925,4.424596220387945,,0.0,0.0,0,4.424596220387945,177.88352274053724,,0.0,0.0,0,177.88352274053724,51.979902678821176,,0.0,0.0,0,51.979902678821176,19.289366631979135,,0.0,0.0,0,19.289366631979135,123.05360807290486,,0.0,0.0,0,123.05360807290486
37,GLY,8.361649142019091,8.38,0.5200009151377173,0.7395833333333334,1,8.415577155344655,4.027926377114553,,0.0,0.0,0,4.027926377114553,173.7417124914308,173.09,0.5200009151377173,0.7395833333333334,1,173.24530726358643,46.388549363702964,46.04,0.5200009151377173,0.7395833333333334,1,46.07311780633811,,,0.0,0.0,0,,108.07564138583638,108.6,0.5200009151377173,0.7395833333333334,1,108.74612540770896
38,ARG,7.871474390187591,7.51,0.5200009151377173,0.7395833333333334,1,7.605169662126763,4.836828480058831,4.89,0.5200009151377173,0.7395833333333334,1,4.882469146042846,175.45534824993342,174.86,0.5200009151377173,0.7395833333333334,1,174.94588996481298,54.50717335916861,53.76,0.5200009151377173,0.7395833333333334,1,53.81704022218892,31.931872413641912,31.74,0.5200009151377173,0.7395833333333334,1,31.863934947641248,119.26600404985015,118.07,0.5200009151377173,0.7395833333333334,1,118.52479804972805
39,VAL,8.317922937085136,8.59,0.5200009151377173,0.7395833333333334,1,8.557232516899766,4.992457295804195,4.96,0.5200009151377173,0.7395833333333334,1,5.002550904306804,176.1396916193418,175.75,0.5200009151377173,0.7395833333333334,1,175.85654316308137,61.83392814991675,61.51,0.5200009151377173,0.7395833333333334,1,61.561416073099124,32.80712708724609,32.45,0.5200009151377173,0.7395833333333334,1,32.41842824532689,121.86544842414253,118.78,0.5200009151377173,0.7395833333333334,1,119.69839666360306
40,GLU,9.130227064052615,9.35,0.5200009151377173,0.7395833333333334,0,9.306344785725386,4.684055737276612,4.9399999999999995,0.5200009151377173,0.7395833333333334,0,4.840751759435009,175.19197052928737,174.54,0.5200009151377173,0.7395833333333334,0,174.82414657955377,54.898210915395715,54.3,0.5200009151377173,0.7395833333333334,0,54.57753252015762,32.982355288045284,34.61,0.5200009151377173,0.7395833333333334,0,34.39673496097791,126.66542471123877,126.39,0.5200009151377173,0.7395833333333334,0,126.7142619437396
41,ASN,8.854601107437007,8.77,0.5200009151377173,0.7395833333333334,1,8.798950938073038,4.289003210175935,4.32,0.5200009151377173,0.7395833333333334,1,4.339071322383173,173.9787155885614,173.81,0.5200009151377173,0.7395833333333334,1,173.87979746627815,54.316674582761685,53.07,0.5200009151377173,0.7395833333333334,1,53.32907558509269,37.58505653181818,36.67,0.5200009151377173,0.7395833333333334,1,36.88119453515373,117.53934654662005,117.93,0.5200009151377173,0.7395833333333334,1,117.86418661517926
42,VAL,8.047627003324452,8.1,0.5200009151377173,0.7395833333333334,1,8.135837540265289,4.5566389940281935,4.05,0.5200009151377173,0.7395833333333334,1,4.147618886552336,176.23152455472862,177.06,0.5200009151377173,0.7395833333333334,1,177.14469172338772,62.89176121596737,64.09,0.5200009151377173,0.7395833333333334,1,63.937784084448886,32.112782573704074,31.27,0.5200009151377173,0.7395833333333334,1,31.382135497546898,120.15497277724498,117.66,0.5200009151377173,0.7395833333333334,1,118.24679866507937
43,GLN,9.093143840120991,9.71,0.5200009151377173,0.7395833333333334,1,9.693780925707625,4.585530029193029,4.63,0.5200009151377173,0.7395833333333334,1,4.639468465967366,174.6176252654512,174.49,0.5200009151377173,0.7395833333333334,1,174.7038344922189,54.234375017893214,54.24,0.5200009151377173,0.7395833333333334,1,54.29586082761683,31.08385834893995,31.74,0.5200009151377173,0.7395833333333334,1,31.72353683085803,127.72095604440004,129.34,0.5200009151377173,0.7395833333333334,1,129.5366790551615
44,ILE,8.954517858424907,8.99,0.5200009151377173,0.7395833333333334,1,8.981470748162948,4.12971057983683,4.19,0.5200009151377173,0.7395833333333334,1,4.208913284265735,176.03968971887002,176.23,0.5200009151377173,0.7395833333333334,1,176.33264941739372,61.58529354378955,60.81,0.5200009151377173,0.7395833333333334,1,60.86851640937396,37.272244027644575,35.73,0.5200009151377173,0.7395833333333334,1,35.81646559631479,125.31526737020756,124.87,0.5200009151377173,0.7395833333333334,1,125.28177891726052
45,LEU,9.041459536269286,9.19,0.5200009151377173,0.7395833333333334,1,9.178978072405371,4.443313504717505,4.37,0.5200009151377173,0.7395833333333334,1,4.374533592562993,177.81713488648018,177.78,0.5200009151377173,0.7395833333333334,1,177.76295239957264,56.181320867221665,56.35,0.5200009151377173,0.7395833333333334,1,56.31841966834277,42.4138851980464,42.53,0.5200009151377173,0.7395833333333334,1,42.66175806431346,129.67266688040849,130.7,0.5200009151377173,0.7395833333333334,1,131.19160895373514
46,SER,8.093082561699411,7.76,0.5200009151377173,0.7395833333333334,1,7.815714249134199,4.68124139965035,4.57,0.5200009151377173,0.7395833333333334,1,4.601405892668443,172.430271363764,172.04,0.5200009151377173,0.7395833333333334,1,172.38742333643577,57.748814145643244,57.76,0.5200009151377173,0.7395833333333334,1,57.75982736859252,64.726839142563,64.31,0.5200009151377173,0.7395833333333334,1,64.43418568398268,110.57196472277722,110.72,0.5200009151377173,0.7395833333333334,1,110.81738356499612
47,ALA,8.620484883666334,8.42,0.5200009151377173,0.7395833333333334,1,8.445947411843711,5.289047378416028,5.16,0.5200009151377173,0.7395833333333334,1,5.213815804972806,175.6038362911644,,0.0,0.0,0,175.6038362911644,51.25664283411033,52.04,0.5200009151377173,0.7395833333333334,1,51.94780489067044,22.075539691813745,22.37,0.5200009151377173,0.7395833333333334,1,22.455788064635367,124.83595378825619,126.92,0.5200009151377173,0.7395833333333334,1,126.6850012612665
48,GLN,8.801858938572538,8.629999999999999,0.5200009151377173,0.7395833333333334,0,8.683756432756132,4.924848236119437,4.3500000000000005,0.5200009151377173,0.7395833333333334,0,4.631978367893218,173.6752811836608,,0.0,0.0,0,173.6752811836608,53.012738081568436,55.85,0.5200009151377173,0.7395833333333334,0,54.266691632228884,32.091999412870464,32.400000000000006,0.5200009151377173,0.7395833333333334,0,32.3839691002331,122.22679459332889,121.84,0.5200009151377173,0.7395833333333334,0,121.97149740795871
49,PRO,,,0.0,0.0,0,,4.720712318242868,4.89,0.5200009151377173,0.7395833333333334,1,4.878185342796093,175.79800372645687,175.35,0.5200009151377173,0.7395833333333334,1,175.48300072054613,63.12960319066489,62.85,0.5200009151377173,0.7395833333333334,1,62.82216923161838,34.1189040992341,34.32,0.5200009151377173,0.7395833333333334,1,34.34819771545122,,,0.0,0.0,0,
50,ALA,8.490027680880232,8.56,0.5200009151377173,0.7395833333333334,1,8.542176262887113,4.201954737148962,4.12,0.5200009151377173,0.7395833333333334,1,4.126425616966367,177.0455034332945,177.35,0.5200009151377173,0.7395833333333334,1,177.40974871007882,52.711329666844264,52.37,0.5200009151377173,0.7395833333333334,1,52.37620532151182,19.01507803530359,20.02,0.5200009151377173,0.7395833333333334,1,19.750829194666448,123.39862731754911,122.87,0.5200009151377173,0.7395833333333334,1,123.31332962882672