RESNUM,RESNAME,H_X,H_Y,H_BEST_REF_SCORE,H_BEST_REF_COV,H_BEST_REF_MATCH,H_UCBShift,HA_X,HA_Y,HA_BEST_REF_SCORE,HA_BEST_REF_COV,HA_BEST_REF_MATCH,HA_UCBShift,C_X,C_Y,C_BEST_REF_SCORE,C_BEST_REF_COV,C_BEST_REF_MATCH,C_UCBShift,CA_X,CA_Y,CA_BEST_REF_SCORE,CA_BEST_REF_COV,CA_BEST_REF_MATCH,CA_UCBShift,CB_X,CB_Y,CB_BEST_REF_SCORE,CB_BEST_REF_COV,CB_BEST_REF_MATCH,CB_UCBShift,N_X,N_Y,N_BEST_REF_SCORE,N_BEST_REF_COV,N_BEST_REF_MATCH,N_UCBShift
1,MET,8.452949114330114,,0,0,0,8.452949114330114,4.397359278710178,,0,0,0,4.397359278710178,174.40948396799868,,0,0,0,174.40948396799868,55.25425478815074,,0,0,0,55.25425478815074,33.22323907899878,,0,0,0,33.22323907899878,121.38704950145964,,0,0,0,121.38704950145964
2,THR,8.303369487301588,,0,0,0,8.303369487301588,4.403247436979687,,0,0,0,4.403247436979687,174.46870779956154,,0,0,0,174.46870779956154,61.560288956948604,,0,0,0,61.560288956948604,69.7980516059829,,0,0,0,69.7980516059829,116.52889192374847,,0,0,0,116.52889192374847
3,LYS,8.297029481795981,,0,0,0,8.297029481795981,4.235548553146853,,0,0,0,4.235548553146853,176.8981533086247,,0,0,0,176.8981533086247,56.140712592057945,,0,0,0,56.140712592057945,32.86260485906871,,0,0,0,32.86260485906871,124.8455977452048,,0,0,0,124.8455977452048
4,ASN,8.587404866017316,,0,0,0,8.587404866017316,4.66142311930847,,0,0,0,4.66142311930847,174.76016974512154,,0,0,0,174.76016974512154,52.90871524126984,,0,0,0,52.90871524126984,38.16785701360861,,0,0,0,38.16785701360861,122.61956531340326,,0,0,0,122.61956531340326
5,THR,8.122665972449774,,0,0,0,8.122665972449774,4.410470171295371,,0,0,0,4.410470171295371,174.6685076275391,,0,0,0,174.6685076275391,61.87115766921966,,0,0,0,61.87115766921966,69.37566482540792,,0,0,0,69.37566482540792,115.9649701127539,,0,0,0,115.9649701127539
6,ARG,8.334449137839938,,0,0,0,8.334449137839938,3.9690854407703404,,0,0,0,3.9690854407703404,175.44967250234765,,0,0,0,175.44967250234765,57.34170266042291,,0,0,0,57.34170266042291,30.288270849095348,,0,0,0,30.288270849095348,123.12674383085803,,0,0,0,123.12674383085803
7,PHE,7.6461327044788545,,0,0,0,7.6461327044788545,4.779910536935287,,0,0,0,4.779910536935287,175.2411921502775,,0,0,0,175.2411921502775,56.72151188689089,,0,0,0,56.72151188689089,40.420356694971694,,0,0,0,40.420356694971694,118.05146855830836,,0,0,0,118.05146855830836
8,SER,8.516913932545233,,0,0,0,8.516913932545233,4.7468215204351205,,0,0,0,4.7468215204351205,174.09011898591407,,0,0,0,174.09011898591407,56.20872933516483,,0,0,0,56.20872933516483,63.2921693567488,,0,0,0,63.2921693567488,118.48828243353867,,0,0,0,118.48828243353867
9,PRO,,,0,0,0,,4.184599307692308,,0,0,0,4.184599307692308,178.60541223661895,,0,0,0,178.60541223661895,65.56204953885003,,0,0,0,65.56204953885003,31.88093172076812,,0,0,0,31.88093172076812,,,0,0,0,
10,GLU,9.295075947879898,,0,0,0,9.295075947879898,3.9448247732239983,,0,0,0,3.9448247732239983,178.7982435738539,,0,0,0,178.7982435738539,59.814793212443114,,0,0,0,59.814793212443114,29.11225650955711,,0,0,0,29.11225650955711,117.2080917991564,,0,0,0,117.2080917991564
11,VAL,7.651511131696081,,0,0,0,7.651511131696081,3.610918581424132,,0,0,0,3.610918581424132,177.81285888218449,,0,0,0,177.81285888218449,65.91047555976802,,0,0,0,65.91047555976802,31.534906607270507,,0,0,0,31.534906607270507,120.23760809600955,,0,0,0,120.23760809600955
12,ARG,7.991656510778111,,0,0,0,7.991656510778111,3.281380013664114,,0,0,0,3.281380013664114,178.1224736517982,,0,0,0,178.1224736517982,60.26833786559551,,0,0,0,60.26833786559551,29.51648644220224,,0,0,0,29.51648644220224,121.4986213467588,,0,0,0,121.4986213467588
13,GLN,8.304988194338994,,0,0,0,8.304988194338994,3.905999938827839,,0,0,0,3.905999938827839,178.05133610137085,,0,0,0,178.05133610137085,58.94434862779443,,0,0,0,58.94434862779443,28.451382037268285,,0,0,0,28.451382037268285,118.37840498711289,,0,0,0,118.37840498711289
14,ARG,8.003607383694083,,0,0,0,8.003607383694083,4.081508968439893,,0,0,0,4.081508968439893,178.67537116599513,,0,0,0,178.67537116599513,58.92535528851704,,0,0,0,58.92535528851704,30.095637188555887,,0,0,0,30.095637188555887,119.77560894195248,,0,0,0,119.77560894195248
15,ALA,8.088630764513265,,0,0,0,8.088630764513265,3.9974878606393607,,0,0,0,3.9974878606393607,179.08539025014986,,0,0,0,179.08539025014986,55.3457799498113,,0,0,0,55.3457799498113,18.02108196911422,,0,0,0,18.02108196911422,123.09976843495393,,0,0,0,123.09976843495393
16,VAL,8.542522428843379,,0,0,0,8.542522428843379,3.493211527922077,,0,0,0,3.493211527922077,177.55826508539795,,0,0,0,177.55826508539795,67.33521355697081,,0,0,0,67.33521355697081,31.65970291126651,,0,0,0,31.65970291126651,118.41153798447108,,0,0,0,118.41153798447108
17,ARG,8.186036293983795,,0,0,0,8.186036293983795,3.9368754814796314,,0,0,0,3.9368754814796314,178.48649134352317,,0,0,0,178.48649134352317,59.6618924511211,,0,0,0,59.6618924511211,30.05312541237651,,0,0,0,30.05312541237651,120.12373592646243,,0,0,0,120.12373592646243
18,MET,8.168836574453325,,0,0,0,8.168836574453325,4.154138291674991,,0,0,0,4.154138291674991,178.5654267079476,,0,0,0,178.5654267079476,59.229074308502604,,0,0,0,59.229074308502604,33.29528005370185,,0,0,0,33.29528005370185,119.47889229175823,,0,0,0,119.47889229175823
19,VAL,7.958684908929958,,0,0,0,7.958684908929958,3.4558643816378067,,0,0,0,3.4558643816378067,177.83118383262294,,0,0,0,177.83118383262294,66.82639705929627,,0,0,0,66.82639705929627,31.381718243595294,,0,0,0,31.381718243595294,119.76422037651793,,0,0,0,119.76422037651793
20,LEU,8.232639321978022,,0,0,0,8.232639321978022,3.9975261073149073,,0,0,0,3.9975261073149073,179.68796447130092,,0,0,0,179.68796447130092,58.020232235869685,,0,0,0,58.020232235869685,41.076271330791435,,0,0,0,41.076271330791435,119.06649467938173,,0,0,0,119.06649467938173
21,GLU,8.37831444050949,,0,0,0,8.37831444050949,4.1094557452852705,,0,0,0,4.1094557452852705,178.60482108598623,,0,0,0,178.60482108598623,59.053948042962595,,0,0,0,59.053948042962595,29.577355796908645,,0,0,0,29.577355796908645,118.99596824580975,,0,0,0,118.99596824580975
22,SER,8.10011601818737,,0,0,0,8.10011601818737,4.536675829470529,,0,0,0,4.536675829470529,175.78298777566877,,0,0,0,175.78298777566877,59.20202801570651,,0,0,0,59.20202801570651,64.18681379174714,,0,0,0,64.18681379174714,113.11772677748918,,0,0,0,113.11772677748918
23,GLN,8.226628437312687,,0,0,0,8.226628437312687,4.246975277794427,,0,0,0,4.246975277794427,177.71934063022533,,0,0,0,177.71934063022533,58.08734127794428,,0,0,0,58.08734127794428,28.547806381712732,,0,0,0,28.547806381712732,123.1831712081141,,0,0,0,123.1831712081141
24,GLY,8.438561057431457,,0,0,0,8.438561057431457,3.9829963694472195,,0,0,0,3.9829963694472195,175.4106298477023,,0,0,0,175.4106298477023,46.383009014208014,,0,0,0,46.383009014208014,,,0,0,0,,107.69049597631812,,0,0,0,107.69049597631812
25,GLU,7.83062985952936,,0,0,0,7.83062985952936,4.2515119089244084,,0,0,0,4.2515119089244084,176.27982029926184,,0,0,0,176.27982029926184,57.23687006122766,,0,0,0,57.23687006122766,30.12947859285159,,0,0,0,30.12947859285159,119.36169083008659,,0,0,0,119.36169083008659
26,TYR,7.320725465068264,,0,0,0,7.320725465068264,4.600490672410922,,0,0,0,4.600490672410922,175.09710535496725,,0,0,0,175.09710535496725,57.188460055960704,,0,0,0,57.188460055960704,39.621200115578866,,0,0,0,39.621200115578866,118.0103744069597,,0,0,0,118.0103744069597
27,ASP,8.66499061076701,,0,0,0,8.66499061076701,4.480081246320346,,0,0,0,4.480081246320346,176.1058215875125,,0,0,0,176.1058215875125,55.27185659349539,,0,0,0,55.27185659349539,41.00418498054168,,0,0,0,41.00418498054168,122.47550170916861,,0,0,0,122.47550170916861
28,SER,7.926309126939728,,0,0,0,7.926309126939728,4.728621731080031,,0,0,0,4.728621731080031,174.64651112737263,,0,0,0,174.64651112737263,57.42185579023754,,0,0,0,57.42185579023754,65.38920777218337,,0,0,0,65.38920777218337,111.82946316721612,,0,0,0,111.82946316721612
29,GLN,9.159381901248752,,0,0,0,9.159381901248752,3.909955414701965,,0,0,0,3.909955414701965,177.46152698653015,,0,0,0,177.46152698653015,59.12738891529026,,0,0,0,59.12738891529026,28.75162159053169,,0,0,0,28.75162159053169,123.37281932272172,,0,0,0,123.37281932272172
30,TRP,8.356788385586636,,0,0,0,8.356788385586636,4.4700084179320685,,0,0,0,4.4700084179320685,177.27686540733708,,0,0,0,177.27686540733708,59.81135631016761,,0,0,0,59.81135631016761,29.691290563847264,,0,0,0,29.691290563847264,120.06558275024975,,0,0,0,120.06558275024975
31,ALA,8.119836844727494,,0,0,0,8.119836844727494,4.058894120562771,,0,0,0,4.058894120562771,179.8071731204629,,0,0,0,179.8071731204629,54.63627313631923,,0,0,0,54.63627313631923,17.9998126485903,,0,0,0,17.9998126485903,121.97902662234986,,0,0,0,121.97902662234986
32,THR,7.964519430863581,,0,0,0,7.964519430863581,3.068356071042846,,0,0,0,3.068356071042846,175.84256129526582,,0,0,0,175.84256129526582,66.36079549919525,,0,0,0,66.36079549919525,68.45743326606171,,0,0,0,68.45743326606171,115.99849598559773,,0,0,0,115.99849598559773
33,ILE,8.469418437318238,,0,0,0,8.469418437318238,3.2574159616050613,,0,0,0,3.2574159616050613,177.42582205721502,,0,0,0,177.42582205721502,65.81824013923298,,0,0,0,65.81824013923298,37.73044427724498,,0,0,0,37.73044427724498,121.94358267370409,,0,0,0,121.94358267370409
34,CYS,8.441340347086248,,0,0,0,8.441340347086248,3.704195511521811,,0,0,0,3.704195511521811,176.37432501896436,,0,0,0,176.37432501896436,62.07490658641359,,0,0,0,62.07490658641359,26.82733173029193,,0,0,0,26.82733173029193,116.65108472407591,,0,0,0,116.65108472407591
35,SER,7.734968157309358,,0,0,0,7.734968157309358,4.23245731002331,,0,0,0,4.23245731002331,176.5780453820402,,0,0,0,176.5780453820402,60.937359732783875,,0,0,0,60.937359732783875,63.24409815720946,,0,0,0,63.24409815720946,114.24300384467755,,0,0,0,114.24300384467755
36,ILE,7.978284052114552,,0,0,0,7.978284052114552,3.5811189451437437,,0,0,0,3.5811189451437437,177.79600987491952,,0,0,0,177.79600987491952,64.59266461493506,,0,0,0,64.59266461493506,38.26393456275391,,0,0,0,38.26393456275391,122.3249886476357,,0,0,0,122.3249886476357
37,ALA,8.54989461974137,,0,0,0,8.54989461974137,3.961566862792763,,0,0,0,3.961566862792763,176.68127686617828,,0,0,0,176.68127686617828,57.140311198168504,,0,0,0,57.140311198168504,16.47369857651238,,0,0,0,16.47369857651238,123.70661957752803,,0,0,0,123.70661957752803
38,PRO,,,0,0,0,,4.39620079062049,,0,0,0,4.39620079062049,178.89031236369743,,0,0,0,178.89031236369743,65.52578287206683,,0,0,0,65.52578287206683,30.843367232151184,,0,0,0,30.843367232151184,,,0,0,0,
39,LYS,7.778097781385281,,0,0,0,7.778097781385281,4.245355615001665,,0,0,0,4.245355615001665,178.20523062387056,,0,0,0,178.20523062387056,58.433530304678655,,0,0,0,58.433530304678655,32.756180629947835,,0,0,0,32.756180629947835,118.54318703874459,,0,0,0,118.54318703874459
40,ILE,7.709335607004107,,0,0,0,7.709335607004107,4.050341034912311,,0,0,0,4.050341034912311,176.50136668105227,,0,0,0,176.50136668105227,61.22543310951826,,0,0,0,61.22543310951826,38.842752268381616,,0,0,0,38.842752268381616,114.15079005831392,,0,0,0,114.15079005831392
41,GLY,8.020701511827061,,0,0,0,8.020701511827061,4.0476794465589965,,0,0,0,4.0476794465589965,174.9656647691253,,0,0,0,174.9656647691253,46.22253339065934,,0,0,0,46.22253339065934,,,0,0,0,,108.61735831484626,,0,0,0,108.61735831484626
42,CYS,8.187953796631147,,0,0,0,8.187953796631147,4.826275711155511,,0,0,0,4.826275711155511,173.96801364511597,,0,0,0,173.96801364511597,56.67582962790543,,0,0,0,56.67582962790543,28.32517051176601,,0,0,0,28.32517051176601,117.19728622476413,,0,0,0,117.19728622476413
43,THR,8.001479810522811,,0,0,0,8.001479810522811,4.568698917415918,,0,0,0,4.568698917415918,174.13206947548562,,0,0,0,174.13206947548562,59.41877573448218,,0,0,0,59.41877573448218,69.00662722357642,,0,0,0,69.00662722357642,114.2019601887335,,0,0,0,114.2019601887335
44,PRO,,,0,0,0,,4.049159016452992,,0,0,0,4.049159016452992,178.31718037069598,,0,0,0,178.31718037069598,65.60734787656233,,0,0,0,65.60734787656233,31.611249095892997,,0,0,0,31.611249095892997,,,0,0,0,
45,GLU,9.056103385142634,,0,0,0,9.056103385142634,4.100494573778999,,0,0,0,4.100494573778999,178.86451902109002,,0,0,0,178.86451902109002,60.00636464054279,,0,0,0,60.00636464054279,29.048696267488065,,0,0,0,29.048696267488065,117.52346959426684,,0,0,0,117.52346959426684
46,THR,7.518426972100123,,0,0,0,7.518426972100123,3.867689312043512,,0,0,0,3.867689312043512,176.50771263675767,,0,0,0,176.50771263675767,65.99046540282495,,0,0,0,65.99046540282495,68.2635795009657,,0,0,0,68.2635795009657,118.02979406081695,,0,0,0,118.02979406081695
47,LEU,7.840178194888445,,0,0,0,7.840178194888445,3.682345644061494,,0,0,0,3.682345644061494,178.2804552110223,,0,0,0,178.2804552110223,57.261224338888894,,0,0,0,57.261224338888894,41.1380513516428,,0,0,0,41.1380513516428,122.08347249160839,,0,0,0,122.08347249160839
48,ARG,8.256874467626819,,0,0,0,8.256874467626819,3.8265879503219002,,0,0,0,3.8265879503219002,178.40377529469976,,0,0,0,178.40377529469976,60.26306310442335,,0,0,0,60.26306310442335,30.128828457953155,,0,0,0,30.128828457953155,120.53575260160395,,0,0,0,120.53575260160395
49,VAL,8.021178401676101,,0,0,0,8.021178401676101,3.8071241709928962,,0,0,0,3.8071241709928962,178.5993467203297,,0,0,0,178.5993467203297,66.10312370563881,,0,0,0,66.10312370563881,31.680609227483625,,0,0,0,31.680609227483625,119.26488211108891,,0,0,0,119.26488211108891
50,TRP,7.999653450937951,,0,0,0,7.999653450937951,4.570211624814075,,0,0,0,4.570211624814075,178.99550364445554,,0,0,0,178.99550364445554,58.08070114525474,,0,0,0,58.08070114525474,29.053594022760574,,0,0,0,29.053594022760574,120.53823336389166,,0,0,0,120.53823336389166
51,VAL,8.735825884792982,,0,0,0,8.735825884792982,3.4988842651071157,,0,0,0,3.4988842651071157,177.76172135609391,,0,0,0,177.76172135609391,67.4824453036852,,0,0,0,67.4824453036852,31.536284083849484,,0,0,0,31.536284083849484,120.42464686305361,,0,0,0,120.42464686305361
52,ARG,8.26782424942835,,0,0,0,8.26782424942835,3.9810450934010433,,0,0,0,3.9810450934010433,179.0744381075369,,0,0,0,179.0744381075369,59.79329836046731,,0,0,0,59.79329836046731,30.202474200593848,,0,0,0,30.202474200593848,119.6593385404984,,0,0,0,119.6593385404984
53,GLN,8.17518379915085,,0,0,0,8.17518379915085,4.204795741114441,,0,0,0,4.204795741114441,178.3593263103896,,0,0,0,178.3593263103896,58.370361084415585,,0,0,0,58.370361084415585,28.46524743982684,,0,0,0,28.46524743982684,119.56143203463203,,0,0,0,119.56143203463203
54,HIS,8.541639462876013,,0,0,0,8.541639462876013,4.180519174297925,,0,0,0,4.180519174297925,177.45676398193473,,0,0,0,177.45676398193473,59.92088203063603,,0,0,0,59.92088203063603,30.154242497047395,,0,0,0,30.154242497047395,119.50218780940726,,0,0,0,119.50218780940726
55,GLU,8.459499362992563,,0,0,0,8.459499362992563,4.0359046587468095,,0,0,0,4.0359046587468095,178.71490963028083,,0,0,0,178.71490963028083,58.745429534654235,,0,0,0,58.745429534654235,29.111459409823507,,0,0,0,29.111459409823507,119.140340447891,,0,0,0,119.140340447891
56,ARG,8.109686276018426,,0,0,0,8.109686276018426,4.1704772946109445,,0,0,0,4.1704772946109445,178.08474215747032,,0,0,0,178.08474215747032,58.16813355242535,,0,0,0,58.16813355242535,30.270327076479077,,0,0,0,30.270327076479077,119.51035503232877,,0,0,0,119.51035503232877
57,ASP,8.153022565728715,,0,0,0,8.153022565728715,4.483177016575091,,0,0,0,4.483177016575091,177.7276120960706,,0,0,0,177.7276120960706,56.4620486449384,,0,0,0,56.4620486449384,41.23052991446887,,0,0,0,41.23052991446887,119.78613688742924,,0,0,0,119.78613688742924
58,THR,8.087488765573315,,0,0,0,8.087488765573315,4.08221561004551,,0,0,0,4.08221561004551,176.11998799127537,,0,0,0,176.11998799127537,64.98679232596848,,0,0,0,64.98679232596848,68.41201116698856,,0,0,0,68.41201116698856,115.09112133798423,,0,0,0,115.09112133798423
59,GLY,8.148257505394605,,0,0,0,8.148257505394605,3.9579863174464434,,0,0,0,3.9579863174464434,175.18109771829282,,0,0,0,175.18109771829282,46.23300812891553,,0,0,0,46.23300812891553,,,0,0,0,,109.28255835150405,,0,0,0,109.28255835150405
60,GLY,7.778289703391053,,0,0,0,7.778289703391053,4.04168116487679,,0,0,0,4.04168116487679,175.08997641161616,,0,0,0,175.08997641161616,46.284769335436785,,0,0,0,46.284769335436785,,,0,0,0,,108.01773527008547,,0,0,0,108.01773527008547
61,ASP,7.884128768409369,,0,0,0,7.884128768409369,4.707060721700522,,0,0,0,4.707060721700522,177.19105514586525,,0,0,0,177.19105514586525,54.367375013492065,,0,0,0,54.367375013492065,41.44025189332889,,0,0,0,41.44025189332889,120.02141275488955,,0,0,0,120.02141275488955
62,ASP,8.185367456199357,,0,0,0,8.185367456199357,4.561185522971472,,0,0,0,4.561185522971472,177.04335887822734,,0,0,0,177.04335887822734,55.52631098423244,,0,0,0,55.52631098423244,40.58811288369964,,0,0,0,40.58811288369964,120.43583457535243,,0,0,0,120.43583457535243
63,GLY,8.501592227061828,,0,0,0,8.501592227061828,3.932043639649239,,0,0,0,3.932043639649239,175.0773001036519,,0,0,0,175.0773001036519,45.23972515492841,,0,0,0,45.23972515492841,,,0,0,0,,107.21523647974247,,0,0,0,107.21523647974247
64,GLY,7.950347754711955,,0,0,0,7.950347754711955,4.022895732678433,,0,0,0,4.022895732678433,174.15269864107006,,0,0,0,174.15269864107006,45.392036091924744,,0,0,0,45.392036091924744,,,0,0,0,,108.77451594015984,,0,0,0,108.77451594015984
65,LEU,7.933058390631591,,0,0,0,7.933058390631591,4.219281922535798,,0,0,0,4.219281922535798,176.894271290898,,0,0,0,176.894271290898,55.32697370460651,,0,0,0,55.32697370460651,41.54980197238872,,0,0,0,41.54980197238872,122.17318244039849,,0,0,0,122.17318244039849
66,THR,8.140797482434232,,0,0,0,8.140797482434232,4.497758523326673,,0,0,0,4.497758523326673,175.15891922059052,,0,0,0,175.15891922059052,61.13221246106116,,0,0,0,61.13221246106116,69.76225324223554,,0,0,0,69.76225324223554,117.94912989192474,,0,0,0,117.94912989192474
67,THR,8.459579405760906,,0,0,0,8.459579405760906,4.20074699476357,,0,0,0,4.20074699476357,176.06077737672325,,0,0,0,176.06077737672325,64.61597491061161,,0,0,0,64.61597491061161,69.05843390101565,,0,0,0,69.05843390101565,116.81308331625596,,0,0,0,116.81308331625596
68,ALA,8.403510596581198,,0,0,0,8.403510596581198,4.15731546542624,,0,0,0,4.15731546542624,178.83675502378733,,0,0,0,178.83675502378733,54.239309267815514,,0,0,0,54.239309267815514,18.765195020041073,,0,0,0,18.765195020041073,123.07666594270174,,0,0,0,123.07666594270174
69,GLU,8.180173834981685,,0,0,0,8.180173834981685,4.147655022555222,,0,0,0,4.147655022555222,178.43194567787768,,0,0,0,178.43194567787768,57.95093276973582,,0,0,0,57.95093276973582,29.86383738082473,,0,0,0,29.86383738082473,116.52388392355978,,0,0,0,116.52388392355978
70,ARG,7.828095423509824,,0,0,0,7.828095423509824,4.163149206324231,,0,0,0,4.163149206324231,177.10124738216786,,0,0,0,177.10124738216786,57.99821433612499,,0,0,0,57.99821433612499,30.09351831176046,,0,0,0,30.09351831176046,119.87540815433455,,0,0,0,119.87540815433455
71,GLN,7.855759443822844,,0,0,0,7.855759443822844,4.250140815395715,,0,0,0,4.250140815395715,176.78975785571095,,0,0,0,176.78975785571095,57.25744608049173,,0,0,0,57.25744608049173,28.942952378571427,,0,0,0,28.942952378571427,117.63929242212232,,0,0,0,117.63929242212232
72,ARG,7.8712272964368974,,0,0,0,7.8712272964368974,4.279782232184482,,0,0,0,4.279782232184482,177.25402982529693,,0,0,0,177.25402982529693,57.57742625299145,,0,0,0,57.57742625299145,30.393126243328894,,0,0,0,30.393126243328894,118.50152622107338,,0,0,0,118.50152622107338
73,LEU,7.877703503846154,,0,0,0,7.877703503846154,4.361001634421135,,0,0,0,4.361001634421135,177.84638559653678,,0,0,0,177.84638559653678,55.95860054220779,,0,0,0,55.95860054220779,41.69986960995116,,0,0,0,41.69986960995116,119.7917368531191,,0,0,0,119.7917368531191
74,LYS,7.820515822605172,,0,0,0,7.820515822605172,4.389877524775224,,0,0,0,4.389877524775224,176.1172345673826,,0,0,0,176.1172345673826,56.5281606473471,,0,0,0,56.5281606473471,32.729814966305916,,0,0,0,32.729814966305916,118.55591371279831,,0,0,0,118.55591371279831
75,GLU,7.679832225158175,,0,0,0,7.679832225158175,4.579027217046842,,0,0,0,4.579027217046842,174.41889725956267,,0,0,0,174.41889725956267,54.18553524007659,,0,0,0,54.18553524007659,30.332107322549675,,0,0,0,30.332107322549675,120.58871439716395,,0,0,0,120.58871439716395
76,PRO,,,0,0,0,,4.62865470017205,,0,0,0,4.62865470017205,177.03436910008327,,0,0,0,177.03436910008327,63.30133792311577,,0,0,0,63.30133792311577,32.232547224347876,,0,0,0,32.232547224347876,,,0,0,0,
77,GLU,8.515918381046731,,0,0,0,8.515918381046731,4.284600413386613,,0,0,0,4.284600413386613,177.29535407683983,,0,0,0,177.29535407683983,58.20285792444223,,0,0,0,58.20285792444223,29.503458478066378,,0,0,0,29.503458478066378,119.53478601106671,,0,0,0,119.53478601106671
78,ARG,8.427369292474193,,0,0,0,8.427369292474193,4.314009234515485,,0,0,0,4.314009234515485,177.47274670632703,,0,0,0,177.47274670632703,58.078896458802305,,0,0,0,58.078896458802305,30.37078007042402,,0,0,0,30.37078007042402,119.74777755927961,,0,0,0,119.74777755927961
79,GLU,8.538939663508714,,0,0,0,8.538939663508714,4.117390087437562,,0,0,0,4.117390087437562,177.7075673400211,,0,0,0,177.7075673400211,58.770656788705736,,0,0,0,58.770656788705736,29.45355844097014,,0,0,0,29.45355844097014,118.94654956602842,,0,0,0,118.94654956602842
80,ASN,8.161130616805417,,0,0,0,8.161130616805417,4.545334394150294,,0,0,0,4.545334394150294,176.84374329403374,,0,0,0,176.84374329403374,55.04376244119769,,0,0,0,55.04376244119769,38.332275738500385,,0,0,0,38.332275738500385,118.36531817849374,,0,0,0,118.36531817849374
81,ARG,7.813593760389611,,0,0,0,7.813593760389611,4.191697094694194,,0,0,0,4.191697094694194,177.6798904641192,,0,0,0,177.6798904641192,58.06757706118326,,0,0,0,58.06757706118326,30.163591215573316,,0,0,0,30.163591215573316,119.55090414289599,,0,0,0,119.55090414289599
82,GLU,7.795328836502387,,0,0,0,7.795328836502387,4.120744018389943,,0,0,0,4.120744018389943,177.7260616870907,,0,0,0,177.7260616870907,58.35288385877456,,0,0,0,58.35288385877456,29.635801953962705,,0,0,0,29.635801953962705,118.88133652850483,,0,0,0,118.88133652850483
83,LEU,8.103590769408369,,0,0,0,8.103590769408369,4.124832943894994,,0,0,0,4.124832943894994,178.82962381623375,,0,0,0,178.82962381623375,57.20255130817516,,0,0,0,57.20255130817516,41.70168895522811,,0,0,0,41.70168895522811,120.48427653697968,,0,0,0,120.48427653697968
84,ARG,7.8980927878232885,,0,0,0,7.8980927878232885,4.145500812259962,,0,0,0,4.145500812259962,177.9112439428627,,0,0,0,177.9112439428627,58.28753052407592,,0,0,0,58.28753052407592,30.176999783161282,,0,0,0,30.176999783161282,118.46592378005883,,0,0,0,118.46592378005883
85,ARG,7.745756745193696,,0,0,0,7.745756745193696,4.1921210730547225,,0,0,0,4.1921210730547225,177.50564216854812,,0,0,0,177.50564216854812,58.070337639910086,,0,0,0,58.070337639910086,30.4034439003663,,0,0,0,30.4034439003663,118.54035472993672,,0,0,0,118.54035472993672
86,SER,7.984955643018093,,0,0,0,7.984955643018093,4.297842313622488,,0,0,0,4.297842313622488,175.58008970739814,,0,0,0,175.58008970739814,60.701607398079695,,0,0,0,60.701607398079695,63.286341548867796,,0,0,0,63.286341548867796,114.34093164665335,,0,0,0,114.34093164665335
87,ASN,8.014297410300811,,0,0,0,8.014297410300811,4.579458992313243,,0,0,0,4.579458992313243,176.44578372770562,,0,0,0,176.44578372770562,54.97469299940615,,0,0,0,54.97469299940615,38.457457038045284,,0,0,0,38.457457038045284,119.57224442260518,,0,0,0,119.57224442260518
88,ASP,8.056059878033079,,0,0,0,8.056059878033079,4.503568769361194,,0,0,0,4.503568769361194,177.4403742527084,,0,0,0,177.4403742527084,56.30417686719392,,0,0,0,56.30417686719392,41.00846149690865,,0,0,0,41.00846149690865,120.07029053396049,,0,0,0,120.07029053396049
89,ILE,7.720399188894438,,0,0,0,7.720399188894438,3.8676081096264845,,0,0,0,3.8676081096264845,177.953763544783,,0,0,0,177.953763544783,64.03285460838606,,0,0,0,64.03285460838606,37.37632079777445,,0,0,0,37.37632079777445,119.7708428956377,,0,0,0,119.7708428956377