RESNUM,RESNAME,H_X,H_Y,H_BEST_REF_SCORE,H_BEST_REF_COV,H_BEST_REF_MATCH,H_UCBShift,HA_X,HA_Y,HA_BEST_REF_SCORE,HA_BEST_REF_COV,HA_BEST_REF_MATCH,HA_UCBShift,C_X,C_Y,C_BEST_REF_SCORE,C_BEST_REF_COV,C_BEST_REF_MATCH,C_UCBShift,CA_X,CA_Y,CA_BEST_REF_SCORE,CA_BEST_REF_COV,CA_BEST_REF_MATCH,CA_UCBShift,CB_X,CB_Y,CB_BEST_REF_SCORE,CB_BEST_REF_COV,CB_BEST_REF_MATCH,CB_UCBShift,N_X,N_Y,N_BEST_REF_SCORE,N_BEST_REF_COV,N_BEST_REF_MATCH,N_UCBShift
1,MET,8.48582664961705,,0,0,0,8.48582664961705,4.322738123770674,,0,0,0,4.322738123770674,175.60911935825285,,0,0,0,175.60911935825285,55.33376174065379,,0,0,0,55.33376174065379,32.922316369208566,,0,0,0,32.922316369208566,121.34569508928848,,0,0,0,121.34569508928848
2,GLY,8.336949162903762,,0,0,0,8.336949162903762,3.9461135804306804,,0,0,0,3.9461135804306804,174.07877005994007,,0,0,0,174.07877005994007,45.17414618471528,,0,0,0,45.17414618471528,,,0,0,0,,111.09341059885115,,0,0,0,111.09341059885115
3,HIS,8.42519133105228,,0,0,0,8.42519133105228,4.461999777944278,,0,0,0,4.461999777944278,174.609261263542,,0,0,0,174.609261263542,56.32493074799645,,0,0,0,56.32493074799645,29.319364741819292,,0,0,0,29.319364741819292,120.22403027535243,,0,0,0,120.22403027535243
4,HIS,8.61371777979243,,0,0,0,8.61371777979243,4.628471174719725,,0,0,0,4.628471174719725,174.66057298961593,,0,0,0,174.66057298961593,55.33319633478188,,0,0,0,55.33319633478188,29.444106234348986,,0,0,0,29.444106234348986,121.3385880435287,,0,0,0,121.3385880435287
5,HIS,8.487757301370852,,0,0,0,8.487757301370852,4.430974186652237,,0,0,0,4.430974186652237,175.133781199223,,0,0,0,175.133781199223,56.01466701087246,,0,0,0,56.01466701087246,29.416201776051725,,0,0,0,29.416201776051725,121.26769950821401,,0,0,0,121.26769950821401
6,HIS,8.581911827633478,,0,0,0,8.581911827633478,4.413577353968254,,0,0,0,4.413577353968254,174.70673613033634,,0,0,0,174.70673613033634,55.814016214812966,,0,0,0,55.814016214812966,29.21209937055167,,0,0,0,29.21209937055167,121.65064435974581,,0,0,0,121.65064435974581
7,HIS,8.44655332977578,,0,0,0,8.44655332977578,4.287475285303586,,0,0,0,4.287475285303586,174.63635779405038,,0,0,0,174.63635779405038,56.78919450931846,,0,0,0,56.78919450931846,30.057650856660008,,0,0,0,30.057650856660008,121.84652179042624,,0,0,0,121.84652179042624
8,HIS,8.657562786607837,,0,0,0,8.657562786607837,4.321414347263847,,0,0,0,4.321414347263847,174.71965570740926,,0,0,0,174.71965570740926,55.873483765956266,,0,0,0,55.873483765956266,28.542573991780444,,0,0,0,28.542573991780444,123.62458986713841,,0,0,0,123.62458986713841
9,SER,8.168383884987236,,0,0,0,8.168383884987236,4.435669402070152,,0,0,0,4.435669402070152,174.3635678770951,,0,0,0,174.3635678770951,58.73100677901542,,0,0,0,58.73100677901542,63.706579715495614,,0,0,0,63.706579715495614,118.04704200304695,,0,0,0,118.04704200304695
10,HIS,8.570388722705072,,0,0,0,8.570388722705072,4.380108482067932,,0,0,0,4.380108482067932,174.55428619060385,,0,0,0,174.55428619060385,56.75783364376734,,0,0,0,56.75783364376734,29.22721003801199,,0,0,0,29.22721003801199,121.8782506868465,,0,0,0,121.8782506868465
11,MET,8.210407478255078,,0,0,0,8.210407478255078,4.238530052475302,,0,0,0,4.238530052475302,174.92807481571208,,0,0,0,174.92807481571208,55.33351563574203,,0,0,0,55.33351563574203,32.83362125328005,,0,0,0,32.83362125328005,122.74996475258075,,0,0,0,122.74996475258075
12,PHE,8.522910221850372,,0,0,0,8.522910221850372,4.6725509345321345,,0,0,0,4.6725509345321345,175.11313257642914,,0,0,0,175.11313257642914,57.37360926756022,,0,0,0,57.37360926756022,39.371810254145856,,0,0,0,39.371810254145856,125.80101148650793,,0,0,0,125.80101148650793
13,ILE,7.785771115506716,,0,0,0,7.785771115506716,4.409108588333889,,0,0,0,4.409108588333889,175.78796485145966,,0,0,0,175.78796485145966,60.701834220557224,,0,0,0,60.701834220557224,38.7730087530969,,0,0,0,38.7730087530969,125.26662886381952,,0,0,0,125.26662886381952
14,GLN,8.80668569846265,,0,0,0,8.80668569846265,4.423294602170052,,0,0,0,4.423294602170052,174.77072535520034,,0,0,0,174.77072535520034,54.801390600227556,,0,0,0,54.801390600227556,30.544635331535133,,0,0,0,30.544635331535133,127.35446869673105,,0,0,0,127.35446869673105
15,THR,8.41492536824287,,0,0,0,8.41492536824287,5.035268217138416,,0,0,0,5.035268217138416,173.96242896754356,,0,0,0,173.96242896754356,60.32208131763236,,0,0,0,60.32208131763236,70.57381491831502,,0,0,0,70.57381491831502,114.77706347802753,,0,0,0,114.77706347802753
16,GLN,8.722941962076812,,0,0,0,8.722941962076812,4.605418769042069,,0,0,0,4.605418769042069,174.39096427711732,,0,0,0,174.39096427711732,54.14499063871129,,0,0,0,54.14499063871129,31.803413860589412,,0,0,0,31.803413860589412,123.85862592316018,,0,0,0,123.85862592316018
17,ASP,8.69429881993007,,0,0,0,8.69429881993007,4.546417505328005,,0,0,0,4.546417505328005,175.6268895909424,,0,0,0,175.6268895909424,54.569508510594964,,0,0,0,54.569508510594964,41.28863502913753,,0,0,0,41.28863502913753,123.95051919557665,,0,0,0,123.95051919557665
18,THR,8.349881694483294,,0,0,0,8.349881694483294,4.814597735753136,,0,0,0,4.814597735753136,173.3364754642857,,0,0,0,173.3364754642857,59.081438861088905,,0,0,0,59.081438861088905,69.90733293786214,,0,0,0,69.90733293786214,115.43271551267067,,0,0,0,115.43271551267067
19,PRO,,,0,0,0,,4.430887660878011,,0,0,0,4.430887660878011,177.19466762486402,,0,0,0,177.19466762486402,63.88793508150738,,0,0,0,63.88793508150738,32.13605673771784,,0,0,0,32.13605673771784,,,0,0,0,
20,ASN,8.1614830502442,,0,0,0,8.1614830502442,5.1536229501332,,0,0,0,5.1536229501332,174.77097336338662,,0,0,0,174.77097336338662,49.94044033973804,,0,0,0,49.94044033973804,39.06899363883894,,0,0,0,39.06899363883894,118.14453749446109,,0,0,0,118.14453749446109
21,PRO,,,0,0,0,,4.415145932511933,,0,0,0,4.415145932511933,176.4747678417305,,0,0,0,176.4747678417305,64.17894559532134,,0,0,0,64.17894559532134,32.11675531744922,,0,0,0,32.11675531744922,,,0,0,0,
22,ASN,8.81955345962926,,0,0,0,8.81955345962926,4.874925820496171,,0,0,0,4.874925820496171,173.8516595056943,,0,0,0,173.8516595056943,53.92975937929848,,0,0,0,53.92975937929848,38.76960110639916,,0,0,0,38.76960110639916,116.22037863092463,,0,0,0,116.22037863092463
23,SER,8.06588080931846,,0,0,0,8.06588080931846,5.690700975768677,,0,0,0,5.690700975768677,173.21878062679542,,0,0,0,173.21878062679542,57.95822956326451,,0,0,0,57.95822956326451,65.57121672475857,,0,0,0,65.57121672475857,117.09246595996227,,0,0,0,117.09246595996227
24,LEU,9.077636755189255,,0,0,0,9.077636755189255,4.415819600632701,,0,0,0,4.415819600632701,174.5723716417083,,0,0,0,174.5723716417083,53.395205588938836,,0,0,0,53.395205588938836,44.470554635914084,,0,0,0,44.470554635914084,126.64999171299812,,0,0,0,126.64999171299812
25,LYS,8.540183394905094,,0,0,0,8.540183394905094,4.778526510844711,,0,0,0,4.778526510844711,174.47070878101897,,0,0,0,174.47070878101897,55.45232760003885,,0,0,0,55.45232760003885,33.921476981723835,,0,0,0,33.921476981723835,126.63105782956488,,0,0,0,126.63105782956488
26,PHE,9.48731973957154,,0,0,0,9.48731973957154,5.196145435053834,,0,0,0,5.196145435053834,174.76900461839273,,0,0,0,174.76900461839273,56.376449841464094,,0,0,0,56.376449841464094,40.90841037529693,,0,0,0,40.90841037529693,124.37635142761683,,0,0,0,124.37635142761683
27,ILE,9.303429325063824,,0,0,0,9.303429325063824,4.884343788633589,,0,0,0,4.884343788633589,174.6921571356366,,0,0,0,174.6921571356366,58.010896605810856,,0,0,0,58.010896605810856,39.90762978431569,,0,0,0,39.90762978431569,123.30453497014098,,0,0,0,123.30453497014098
28,PRO,,,0,0,0,,4.5251382170496175,,0,0,0,4.5251382170496175,176.0791027050505,,0,0,0,176.0791027050505,63.39749722595737,,0,0,0,63.39749722595737,32.10132419988345,,0,0,0,32.10132419988345,,,0,0,0,
29,GLY,8.306619092846043,,0,0,0,8.306619092846043,3.92738830931846,,0,0,0,3.92738830931846,173.57077283272838,,0,0,0,173.57077283272838,45.58343425675991,,0,0,0,45.58343425675991,,,0,0,0,,108.60170604544344,,0,0,0,108.60170604544344
30,LYS,7.173285252741703,,0,0,0,7.173285252741703,4.663226372222222,,0,0,0,4.663226372222222,173.67183645542792,,0,0,0,173.67183645542792,53.46700171528472,,0,0,0,53.46700171528472,32.855034161460765,,0,0,0,32.855034161460765,117.97782386574536,,0,0,0,117.97782386574536
31,PRO,,,0,0,0,,4.356608441733267,,0,0,0,4.356608441733267,176.89703420805307,,0,0,0,176.89703420805307,63.266400465440114,,0,0,0,63.266400465440114,31.99510252059052,,0,0,0,31.99510252059052,,,0,0,0,
32,VAL,8.650864399811299,,0,0,0,8.650864399811299,4.01200743502886,,0,0,0,4.01200743502886,175.53628191142747,,0,0,0,175.53628191142747,63.53601473451548,,0,0,0,63.53601473451548,32.431116996953044,,0,0,0,32.431116996953044,121.04942350018315,,0,0,0,121.04942350018315
33,LEU,8.093837127827728,,0,0,0,8.093837127827728,4.5343980318459325,,0,0,0,4.5343980318459325,177.67421649766345,,0,0,0,177.67421649766345,53.9379735020646,,0,0,0,53.9379735020646,42.57551267022977,,0,0,0,42.57551267022977,121.7183823072816,,0,0,0,121.7183823072816
34,GLU,8.715581441042291,,0,0,0,8.715581441042291,4.05467461915307,,0,0,0,4.05467461915307,177.18847364315684,,0,0,0,177.18847364315684,59.031948932767236,,0,0,0,59.031948932767236,29.599628403996004,,0,0,0,29.599628403996004,122.96136735859696,,0,0,0,122.96136735859696
35,THR,8.004694161488512,,0,0,0,8.004694161488512,4.4277119128982125,,0,0,0,4.4277119128982125,174.48359302468086,,0,0,0,174.48359302468086,62.050949247846596,,0,0,0,62.050949247846596,69.55006723813963,,0,0,0,69.55006723813963,108.04675922046287,,0,0,0,108.04675922046287
36,ARG,7.717978364968365,,0,0,0,7.717978364968365,4.657147792690642,,0,0,0,4.657147792690642,175.12446290503942,,0,0,0,175.12446290503942,55.22712735561105,,0,0,0,55.22712735561105,31.988493225724273,,0,0,0,31.988493225724273,122.32075281091132,,0,0,0,122.32075281091132
37,THR,8.256484015506716,,0,0,0,8.256484015506716,5.307984153213454,,0,0,0,5.307984153213454,173.83507612990343,,0,0,0,173.83507612990343,60.24167905214785,,0,0,0,60.24167905214785,71.15571386315906,,0,0,0,71.15571386315906,112.86005999373404,,0,0,0,112.86005999373404
38,MET,8.546257853663002,,0,0,0,8.546257853663002,4.556754113580864,,0,0,0,4.556754113580864,173.3433473643634,,0,0,0,173.3433473643634,54.52420301761572,,0,0,0,54.52420301761572,35.771353334781885,,0,0,0,35.771353334781885,121.67788847106782,,0,0,0,121.67788847106782
39,ASP,8.273943245421245,,0,0,0,8.273943245421245,4.907909663852814,,0,0,0,4.907909663852814,174.58576001573428,,0,0,0,174.58576001573428,53.66241848388834,,0,0,0,53.66241848388834,42.439253639471644,,0,0,0,42.439253639471644,123.28634763836719,,0,0,0,123.28634763836719
40,PHE,8.985472083682984,,0,0,0,8.985472083682984,5.23116173001443,,0,0,0,5.23116173001443,174.63048962170606,,0,0,0,174.63048962170606,54.447219424852925,,0,0,0,54.447219424852925,39.99397702721168,,0,0,0,39.99397702721168,121.51208797555778,,0,0,0,121.51208797555778
41,PRO,,,0,0,0,,4.667093722821623,,0,0,0,4.667093722821623,175.73272793191808,,0,0,0,175.73272793191808,64.2514302500222,,0,0,0,64.2514302500222,32.49117186200466,,0,0,0,32.49117186200466,,,0,0,0,
42,THR,7.323055119430569,,0,0,0,7.323055119430569,4.558095296475747,,0,0,0,4.558095296475747,172.8334557277611,,0,0,0,172.8334557277611,58.94798411183261,,0,0,0,58.94798411183261,70.3616583999667,,0,0,0,70.3616583999667,110.58000091052836,,0,0,0,110.58000091052836
43,PRO,,,0,0,0,,3.2656929905955145,,0,0,0,3.2656929905955145,177.13596258713508,,0,0,0,177.13596258713508,64.76859538307804,,0,0,0,64.76859538307804,31.243528254417804,,0,0,0,31.243528254417804,,,0,0,0,
44,ALA,8.240736716067266,,0,0,0,8.240736716067266,4.092797716894217,,0,0,0,4.092797716894217,178.938092131352,,0,0,0,178.938092131352,54.377837178565876,,0,0,0,54.377837178565876,18.329790315179267,,0,0,0,18.329790315179267,118.89817510913531,,0,0,0,118.89817510913531
45,ALA,7.975481202886003,,0,0,0,7.975481202886003,4.24228941999667,,0,0,0,4.24228941999667,178.570143973804,,0,0,0,178.570143973804,54.24406211635586,,0,0,0,54.24406211635586,18.66640441663892,,0,0,0,18.66640441663892,119.61391844623154,,0,0,0,119.61391844623154
46,ALA,7.90003008956044,,0,0,0,7.90003008956044,3.9525694969724725,,0,0,0,3.9525694969724725,178.19961750666556,,0,0,0,178.19961750666556,53.538261352580754,,0,0,0,53.538261352580754,18.899206224597627,,0,0,0,18.899206224597627,119.04832477812188,,0,0,0,119.04832477812188
47,PHE,7.9183165081696085,,0,0,0,7.9183165081696085,4.264773053102453,,0,0,0,4.264773053102453,176.53617967227774,,0,0,0,176.53617967227774,60.298244584526586,,0,0,0,60.298244584526586,37.29191011799312,,0,0,0,37.29191011799312,117.1799278084582,,0,0,0,117.1799278084582
48,ARG,7.012058037062937,,0,0,0,7.012058037062937,4.138073841663892,,0,0,0,4.138073841663892,175.81122297064604,,0,0,0,175.81122297064604,56.62692002049617,,0,0,0,56.62692002049617,30.61639596114996,,0,0,0,30.61639596114996,118.21896981388612,,0,0,0,118.21896981388612
49,SER,7.8811044449439445,,0,0,0,7.8811044449439445,5.322152241419692,,0,0,0,5.322152241419692,173.83904862050727,,0,0,0,173.83904862050727,54.67966589539349,,0,0,0,54.67966589539349,64.48614243894994,,0,0,0,64.48614243894994,115.48058681728271,,0,0,0,115.48058681728271
50,PRO,,,0,0,0,,4.267701222438673,,0,0,0,4.267701222438673,178.40502768720168,,0,0,0,178.40502768720168,65.21728808308913,,0,0,0,65.21728808308913,32.37878589122544,,0,0,0,32.37878589122544,,,0,0,0,
51,LEU,7.239065583666333,,0,0,0,7.239065583666333,3.5496391998335004,,0,0,0,3.5496391998335004,177.55882366937507,,0,0,0,177.55882366937507,57.3390827484571,,0,0,0,57.3390827484571,39.69970668600843,,0,0,0,39.69970668600843,119.30793189458875,,0,0,0,119.30793189458875
52,ALA,7.9785270243034745,,0,0,0,7.9785270243034745,3.555810217030192,,0,0,0,3.555810217030192,179.01100304950606,,0,0,0,179.01100304950606,55.27312181611722,,0,0,0,55.27312181611722,17.198462861566213,,0,0,0,17.198462861566213,121.7070285543956,,0,0,0,121.7070285543956
53,ARG,8.331263617599069,,0,0,0,8.331263617599069,3.96426550018315,,0,0,0,3.96426550018315,178.98574606686648,,0,0,0,178.98574606686648,59.645682499450544,,0,0,0,59.645682499450544,30.190298690764788,,0,0,0,30.190298690764788,117.58364346149406,,0,0,0,117.58364346149406
54,GLN,7.924242016477967,,0,0,0,7.924242016477967,4.103484843595294,,0,0,0,4.103484843595294,179.20529831197135,,0,0,0,179.20529831197135,58.93224381514042,,0,0,0,58.93224381514042,28.843299504534354,,0,0,0,28.843299504534354,118.89024276887557,,0,0,0,118.89024276887557
55,LEU,8.501636306149406,,0,0,0,8.501636306149406,3.8824690836108338,,0,0,0,3.8824690836108338,179.07756162750027,,0,0,0,179.07756162750027,57.640514415873014,,0,0,0,57.640514415873014,42.19386671828172,,0,0,0,42.19386671828172,121.25292482732823,,0,0,0,121.25292482732823
56,PHE,8.39261925905206,,0,0,0,8.39261925905206,4.424167977922077,,0,0,0,4.424167977922077,176.90837849874015,,0,0,0,176.90837849874015,59.03951311727162,,0,0,0,59.03951311727162,38.15888583936619,,0,0,0,38.15888583936619,114.226015162543,,0,0,0,114.226015162543
57,ARG,7.797461062487513,,0,0,0,7.797461062487513,4.229161955810856,,0,0,0,4.229161955810856,176.67148123937176,,0,0,0,176.67148123937176,57.04838078996004,,0,0,0,57.04838078996004,30.565967417288267,,0,0,0,30.565967417288267,117.5454693483239,,0,0,0,117.5454693483239
58,ILE,7.473004595670996,,0,0,0,7.473004595670996,3.952925162223888,,0,0,0,3.952925162223888,175.65568552819957,,0,0,0,175.65568552819957,61.21868252641248,,0,0,0,61.21868252641248,38.18811127832723,,0,0,0,38.18811127832723,121.79414416915307,,0,0,0,121.79414416915307
59,GLU,8.646807685608836,,0,0,0,8.646807685608836,4.00145925560273,,0,0,0,4.00145925560273,177.5539814519092,,0,0,0,177.5539814519092,58.23302713796759,,0,0,0,58.23302713796759,29.532787315789765,,0,0,0,29.532787315789765,128.32839140618825,,0,0,0,128.32839140618825
60,GLY,8.64520902997003,,0,0,0,8.64520902997003,3.862285467252193,,0,0,0,3.862285467252193,173.68571298528693,,0,0,0,173.68571298528693,45.228951294483295,,0,0,0,45.228951294483295,,,0,0,0,,111.88072292667333,,0,0,0,111.88072292667333
61,VAL,7.764467678016428,,0,0,0,7.764467678016428,3.939807141053391,,0,0,0,3.939807141053391,174.99876303952715,,0,0,0,174.99876303952715,64.33250055778666,,0,0,0,64.33250055778666,31.59685356587857,,0,0,0,31.59685356587857,121.91754626384171,,0,0,0,121.91754626384171
62,LYS,9.083868140542789,,0,0,0,9.083868140542789,4.493480585603286,,0,0,0,4.493480585603286,176.71416897694527,,0,0,0,176.71416897694527,57.40003112529693,,0,0,0,57.40003112529693,34.178768199850154,,0,0,0,34.178768199850154,132.00153802132868,,0,0,0,132.00153802132868
63,SER,8.01175161804307,,0,0,0,8.01175161804307,5.239315972466422,,0,0,0,5.239315972466422,172.0340158758075,,0,0,0,172.0340158758075,57.7422647023088,,0,0,0,57.7422647023088,66.0602618034854,,0,0,0,66.0602618034854,110.63527084242425,,0,0,0,110.63527084242425
64,VAL,9.011297963802862,,0,0,0,9.011297963802862,5.038914623021423,,0,0,0,5.038914623021423,173.99941573429348,,0,0,0,173.99941573429348,60.51892630033855,,0,0,0,60.51892630033855,35.22895844292929,,0,0,0,35.22895844292929,121.06300877183372,,0,0,0,121.06300877183372
65,PHE,9.330809960112111,,0,0,0,9.330809960112111,5.26855707015762,,0,0,0,5.26855707015762,173.5962398800755,,0,0,0,173.5962398800755,55.654962346320346,,0,0,0,55.654962346320346,42.96583830380175,,0,0,0,42.96583830380175,127.0935428607337,,0,0,0,127.0935428607337
66,PHE,8.96407467924853,,0,0,0,8.96407467924853,5.471629773937172,,0,0,0,5.471629773937172,175.61370371312023,,0,0,0,175.61370371312023,53.19823265452326,,0,0,0,53.19823265452326,40.17269666663337,,0,0,0,40.17269666663337,126.22273171423576,,0,0,0,126.22273171423576
67,GLY,9.018562727927629,,0,0,0,9.018562727927629,4.165858753171828,,0,0,0,4.165858753171828,173.65390933035297,,0,0,0,173.65390933035297,44.0888395477245,,0,0,0,44.0888395477245,,,0,0,0,,111.90537561400266,,0,0,0,111.90537561400266
68,PRO,,,0,0,0,,4.5219441903818405,,0,0,0,4.5219441903818405,176.6888049435176,,0,0,0,176.6888049435176,65.19254335779776,,0,0,0,65.19254335779776,32.09077826081696,,0,0,0,32.09077826081696,,,0,0,0,
69,ASP,8.27731732082362,,0,0,0,8.27731732082362,4.851902633993784,,0,0,0,4.851902633993784,175.12733460198692,,0,0,0,175.12733460198692,53.80817258595849,,0,0,0,53.80817258595849,41.80618509677545,,0,0,0,41.80618509677545,113.53554404151406,,0,0,0,113.53554404151406
70,SER,7.795278777150627,,0,0,0,7.795278777150627,5.182450701998002,,0,0,0,5.182450701998002,172.4774531252303,,0,0,0,172.4774531252303,57.58506399311799,,0,0,0,57.58506399311799,66.70918952308247,,0,0,0,66.70918952308247,112.26214916729383,,0,0,0,112.26214916729383
71,ILE,9.227337173559775,,0,0,0,9.227337173559775,5.164073707115107,,0,0,0,5.164073707115107,175.3771255390887,,0,0,0,175.3771255390887,60.54853406858697,,0,0,0,60.54853406858697,40.503942604095904,,0,0,0,40.503942604095904,122.31931884731381,,0,0,0,122.31931884731381
72,THR,9.299792506110558,,0,0,0,9.299792506110558,5.30814388072483,,0,0,0,5.30814388072483,173.83965823629148,,0,0,0,173.83965823629148,62.17817167020202,,0,0,0,62.17817167020202,70.21218357320457,,0,0,0,70.21218357320457,124.981637752553,,0,0,0,124.981637752553
73,VAL,9.614189076418025,,0,0,0,9.614189076418025,4.914488734915084,,0,0,0,4.914488734915084,174.70342424798537,,0,0,0,174.70342424798537,60.839054955788654,,0,0,0,60.839054955788654,33.75945437111222,,0,0,0,33.75945437111222,127.3488017953824,,0,0,0,127.3488017953824
74,THR,8.980016773654123,,0,0,0,8.980016773654123,5.436806638622489,,0,0,0,5.436806638622489,174.38430712874901,,0,0,0,174.38430712874901,61.57249583192363,,0,0,0,61.57249583192363,70.17394230941281,,0,0,0,70.17394230941281,122.3794991129759,,0,0,0,122.3794991129759
75,LYS,8.97596004133644,,0,0,0,8.97596004133644,4.700591711832612,,0,0,0,4.700591711832612,176.89331198001997,,0,0,0,176.89331198001997,55.09121227628483,,0,0,0,55.09121227628483,33.91224633634144,,0,0,0,33.91224633634144,125.67433400406262,,0,0,0,125.67433400406262
76,GLU,8.892931979070928,,0,0,0,8.892931979070928,4.118071475990676,,0,0,0,4.118071475990676,176.17348078088577,,0,0,0,176.17348078088577,59.152103166949715,,0,0,0,59.152103166949715,30.335209605949604,,0,0,0,30.335209605949604,120.88070166550116,,0,0,0,120.88070166550116
77,ASN,7.336029141219892,,0,0,0,7.336029141219892,4.762394293672994,,0,0,0,4.762394293672994,175.0377809742757,,0,0,0,175.0377809742757,52.305190086918635,,0,0,0,52.305190086918635,40.32861394711955,,0,0,0,40.32861394711955,112.90680423795094,,0,0,0,112.90680423795094
78,GLU,8.775853846048395,,0,0,0,8.775853846048395,4.230196496048396,,0,0,0,4.230196496048396,177.54329314586525,,0,0,0,177.54329314586525,59.003125884254636,,0,0,0,59.003125884254636,29.32397913041958,,0,0,0,29.32397913041958,119.21591519148075,,0,0,0,119.21591519148075
79,GLU,8.184351374986125,,0,0,0,8.184351374986125,4.149502083785658,,0,0,0,4.149502083785658,176.7516429100122,,0,0,0,176.7516429100122,57.3257184483572,,0,0,0,57.3257184483572,29.81735780275835,,0,0,0,29.81735780275835,118.51240577802753,,0,0,0,118.51240577802753
80,LEU,7.595800785353535,,0,0,0,7.595800785353535,4.197768642404817,,0,0,0,4.197768642404817,177.09247287627926,,0,0,0,177.09247287627926,54.92351212738928,,0,0,0,54.92351212738928,42.418043338533685,,0,0,0,42.418043338533685,120.97729103285603,,0,0,0,120.97729103285603
81,ASP,8.52515806968032,,0,0,0,8.52515806968032,4.587550422446998,,0,0,0,4.587550422446998,177.07589195143746,,0,0,0,177.07589195143746,53.79252861090576,,0,0,0,53.79252861090576,42.08942142694528,,0,0,0,42.08942142694528,122.54105601645023,,0,0,0,122.54105601645023
82,TRP,9.075988683533133,,0,0,0,9.075988683533133,4.491168948529249,,0,0,0,4.491168948529249,178.1467184083916,,0,0,0,178.1467184083916,59.80884311260961,,0,0,0,59.80884311260961,30.091619272799424,,0,0,0,30.091619272799424,126.52721459098679,,0,0,0,126.52721459098679
83,ASN,8.408008911582861,,0,0,0,8.408008911582861,4.604573327639028,,0,0,0,4.604573327639028,177.24390810048286,,0,0,0,177.24390810048286,55.733419575801975,,0,0,0,55.733419575801975,38.24754941471306,,0,0,0,38.24754941471306,117.8895210518759,,0,0,0,117.8895210518759
84,LEU,7.638759570806971,,0,0,0,7.638759570806971,4.26331218437951,,0,0,0,4.26331218437951,178.81432490670994,,0,0,0,178.81432490670994,57.08469527454768,,0,0,0,57.08469527454768,42.1944285016761,,0,0,0,42.1944285016761,119.89919738553114,,0,0,0,119.89919738553114
85,LEU,8.170915826451326,,0,0,0,8.170915826451326,4.09550538028638,,0,0,0,4.09550538028638,178.9414595094461,,0,0,0,178.9414595094461,57.34104737017982,,0,0,0,57.34104737017982,42.177964484265736,,0,0,0,42.177964484265736,119.01212414646464,,0,0,0,119.01212414646464
86,LYS,8.51491893040848,,0,0,0,8.51491893040848,3.97095602519425,,0,0,0,3.97095602519425,175.7692489513653,,0,0,0,175.7692489513653,62.68933151405818,,0,0,0,62.68933151405818,29.634458049916752,,0,0,0,29.634458049916752,120.29680188945498,,0,0,0,120.29680188945498
87,PRO,,,0,0,0,,4.361212696148296,,0,0,0,4.361212696148296,179.0597029042735,,0,0,0,179.0597029042735,66.32004408848374,,0,0,0,66.32004408848374,30.876537132550784,,0,0,0,30.876537132550784,,,0,0,0,
88,ASP,8.22944009107004,,0,0,0,8.22944009107004,4.478744708497058,,0,0,0,4.478744708497058,178.9719334585803,,0,0,0,178.9719334585803,57.25352149595405,,0,0,0,57.25352149595405,40.670449546781,,0,0,0,40.670449546781,117.38856037212233,,0,0,0,117.38856037212233
89,ILE,8.28624133000888,,0,0,0,8.28624133000888,3.3858370680680427,,0,0,0,3.3858370680680427,177.66565847778332,,0,0,0,177.66565847778332,65.67754197802198,,0,0,0,65.67754197802198,37.68857846291486,,0,0,0,37.68857846291486,121.45377008614165,,0,0,0,121.45377008614165
90,TYR,8.698078849372848,,0,0,0,8.698078849372848,4.5177573225441225,,0,0,0,4.5177573225441225,178.42985074492174,,0,0,0,178.42985074492174,60.12529381782107,,0,0,0,60.12529381782107,36.56137986127761,,0,0,0,36.56137986127761,119.66401333417139,,0,0,0,119.66401333417139