RESNUM,RESNAME,H_X,H_Y,H_BEST_REF_SCORE,H_BEST_REF_COV,H_BEST_REF_MATCH,H_UCBShift,HA_X,HA_Y,HA_BEST_REF_SCORE,HA_BEST_REF_COV,HA_BEST_REF_MATCH,HA_UCBShift,C_X,C_Y,C_BEST_REF_SCORE,C_BEST_REF_COV,C_BEST_REF_MATCH,C_UCBShift,CA_X,CA_Y,CA_BEST_REF_SCORE,CA_BEST_REF_COV,CA_BEST_REF_MATCH,CA_UCBShift,CB_X,CB_Y,CB_BEST_REF_SCORE,CB_BEST_REF_COV,CB_BEST_REF_MATCH,CB_UCBShift,N_X,N_Y,N_BEST_REF_SCORE,N_BEST_REF_COV,N_BEST_REF_MATCH,N_UCBShift
1,MET,8.479524811865911,,0,0,0,8.479524811865911,4.322725101071151,,0,0,0,4.322725101071151,172.81516284070375,,0,0,0,172.81516284070375,55.1836639078366,,0,0,0,55.1836639078366,33.23445089391719,,0,0,0,33.23445089391719,120.41647096273171,,0,0,0,120.41647096273171
2,LYS,8.508225847557997,,0,0,0,8.508225847557997,4.832395752558553,,0,0,0,4.832395752558553,175.4573635104451,,0,0,0,175.4573635104451,55.223849911188815,,0,0,0,55.223849911188815,34.29281856822067,,0,0,0,34.29281856822067,123.68901137190588,,0,0,0,123.68901137190588
3,ILE,8.739227705588856,,0,0,0,8.739227705588856,4.294320892601843,,0,0,0,4.294320892601843,173.79702237995338,,0,0,0,173.79702237995338,59.95919503968254,,0,0,0,59.95919503968254,39.85100345260295,,0,0,0,39.85100345260295,123.67286665865801,,0,0,0,123.67286665865801
4,SER,8.320418541747141,,0,0,0,8.320418541747141,5.380652083710734,,0,0,0,5.380652083710734,173.636425911211,,0,0,0,173.636425911211,56.82275470510045,,0,0,0,56.82275470510045,64.90004143809523,,0,0,0,64.90004143809523,121.21756751208235,,0,0,0,121.21756751208235
5,ILE,9.035215783516485,,0,0,0,9.035215783516485,4.83003691016206,,0,0,0,4.83003691016206,174.3659854155067,,0,0,0,174.3659854155067,59.471428436152735,,0,0,0,59.471428436152735,41.85587146577866,,0,0,0,41.85587146577866,118.63009986959707,,0,0,0,118.63009986959707
6,GLU,8.620954617843267,,0,0,0,8.620954617843267,5.476538480536131,,0,0,0,5.476538480536131,175.13866343169607,,0,0,0,175.13866343169607,54.35353102905983,,0,0,0,54.35353102905983,33.75912414178599,,0,0,0,33.75912414178599,120.25954791455212,,0,0,0,120.25954791455212
7,ALA,8.926774259107559,,0,0,0,8.926774259107559,4.793985870707071,,0,0,0,4.793985870707071,175.19804660203687,,0,0,0,175.19804660203687,51.401895432822734,,0,0,0,51.401895432822734,22.911557374009323,,0,0,0,22.911557374009323,123.08720722371517,,0,0,0,123.08720722371517
8,HIS,8.949152153452102,,0,0,0,8.949152153452102,5.132904225108225,,0,0,0,5.132904225108225,173.8431234043179,,0,0,0,173.8431234043179,55.314171246353645,,0,0,0,55.314171246353645,29.995275245387944,,0,0,0,29.995275245387944,121.60634840425685,,0,0,0,121.60634840425685
9,ILE,9.149090797430347,,0,0,0,9.149090797430347,4.527010353443779,,0,0,0,4.527010353443779,176.06568033817848,,0,0,0,176.06568033817848,60.324548924203576,,0,0,0,60.324548924203576,39.201647734604286,,0,0,0,39.201647734604286,126.75329403181819,,0,0,0,126.75329403181819
10,GLU,8.999647108613608,,0,0,0,8.999647108613608,4.493170255566655,,0,0,0,4.493170255566655,176.00262457153403,,0,0,0,176.00262457153403,57.21913375795316,,0,0,0,57.21913375795316,29.031708154417803,,0,0,0,29.031708154417803,127.43782713514818,,0,0,0,127.43782713514818
11,GLN,8.411770290537241,,0,0,0,8.411770290537241,4.550284011871462,,0,0,0,4.550284011871462,175.35962857489733,,0,0,0,175.35962857489733,54.26928621411921,,0,0,0,54.26928621411921,32.59305475119325,,0,0,0,32.59305475119325,118.96479435648796,,0,0,0,118.96479435648796
12,GLU,8.748394385853036,,0,0,0,8.748394385853036,4.322818601667777,,0,0,0,4.322818601667777,177.3742671522533,,0,0,0,177.3742671522533,56.66981650294706,,0,0,0,56.66981650294706,30.067461724747474,,0,0,0,30.067461724747474,121.53443053029193,,0,0,0,121.53443053029193
13,ILE,8.90233053889444,,0,0,0,8.90233053889444,4.176460802275503,,0,0,0,4.176460802275503,177.34680805373515,,0,0,0,177.34680805373515,64.11887840093796,,0,0,0,64.11887840093796,37.40091606993562,,0,0,0,37.40091606993562,123.5187690910756,,0,0,0,123.5187690910756
14,GLU,9.04019242949828,,0,0,0,9.04019242949828,4.109951433763459,,0,0,0,4.109951433763459,179.11219013290042,,0,0,0,179.11219013290042,60.01927111348651,,0,0,0,60.01927111348651,29.060376498651348,,0,0,0,29.060376498651348,121.7262653043623,,0,0,0,121.7262653043623
15,ALA,7.871096657509158,,0,0,0,7.871096657509158,4.250634432961483,,0,0,0,4.250634432961483,180.37696157449219,,0,0,0,180.37696157449219,54.7663886082029,,0,0,0,54.7663886082029,18.463623760300813,,0,0,0,18.463623760300813,122.65522161435231,,0,0,0,122.65522161435231
16,VAL,8.241851583055832,,0,0,0,8.241851583055832,3.734158448310023,,0,0,0,3.734158448310023,177.38295660477857,,0,0,0,177.38295660477857,67.22041966171606,,0,0,0,67.22041966171606,31.61651342837163,,0,0,0,31.61651342837163,119.24261492068487,,0,0,0,119.24261492068487
17,TRP,8.985364898318348,,0,0,0,8.985364898318348,3.9587797123321122,,0,0,0,3.9587797123321122,178.11282594069817,,0,0,0,178.11282594069817,61.02291051597292,,0,0,0,61.02291051597292,29.731098911677215,,0,0,0,29.731098911677215,121.29361456143856,,0,0,0,121.29361456143856
18,TRP,8.805989119608169,,0,0,0,8.805989119608169,4.2223398493007,,0,0,0,4.2223398493007,177.9678471878344,,0,0,0,177.9678471878344,61.649217466161616,,0,0,0,61.649217466161616,29.204267322677325,,0,0,0,29.204267322677325,122.14308726050061,,0,0,0,122.14308726050061
19,ALA,8.417673431479631,,0,0,0,8.417673431479631,3.990536785722611,,0,0,0,3.990536785722611,179.19206640885227,,0,0,0,179.19206640885227,55.095947966305914,,0,0,0,55.095947966305914,18.44924928921079,,0,0,0,18.44924928921079,122.39181436849816,,0,0,0,122.39181436849816
20,TRP,8.922573608752359,,0,0,0,8.922573608752359,4.000832427775003,,0,0,0,4.000832427775003,177.18585854336774,,0,0,0,177.18585854336774,60.75795482127317,,0,0,0,60.75795482127317,29.591113433449884,,0,0,0,29.591113433449884,121.45549121539571,,0,0,0,121.45549121539571
21,ASN,7.629449748373849,,0,0,0,7.629449748373849,4.593148029137529,,0,0,0,4.593148029137529,175.10926287910422,,0,0,0,175.10926287910422,53.83474419806305,,0,0,0,53.83474419806305,40.404262124403374,,0,0,0,40.404262124403374,113.57715312162283,,0,0,0,113.57715312162283
22,ASP,7.9063760091852595,,0,0,0,7.9063760091852595,4.673416457647908,,0,0,0,4.673416457647908,175.07157366615053,,0,0,0,175.07157366615053,52.33796456608392,,0,0,0,52.33796456608392,41.086615313220115,,0,0,0,41.086615313220115,121.56871989164169,,0,0,0,121.56871989164169
23,PRO,,,0,0,0,,4.15345966456044,,0,0,0,4.15345966456044,178.5896612963703,,0,0,0,178.5896612963703,65.21561213906094,,0,0,0,65.21561213906094,32.31938237016317,,0,0,0,32.31938237016317,,,0,0,0,
24,ASP,7.938797789649239,,0,0,0,7.938797789649239,4.3521968906121655,,0,0,0,4.3521968906121655,178.44801036309246,,0,0,0,178.44801036309246,57.08451323033633,,0,0,0,57.08451323033633,40.28332435731491,,0,0,0,40.28332435731491,118.39306369725276,,0,0,0,118.39306369725276
25,CYS,8.14268390959041,,0,0,0,8.14268390959041,4.201886263780664,,0,0,0,4.201886263780664,176.83543249376734,,0,0,0,176.83543249376734,62.32362877856033,,0,0,0,62.32362877856033,26.67789618964369,,0,0,0,26.67789618964369,118.73330373764013,,0,0,0,118.73330373764013
26,ILE,8.535422606998557,,0,0,0,8.535422606998557,2.976240310212009,,0,0,0,2.976240310212009,177.3948240700466,,0,0,0,177.3948240700466,65.6871835419414,,0,0,0,65.6871835419414,37.0679709034965,,0,0,0,37.0679709034965,121.50400648561994,,0,0,0,121.50400648561994
27,ALA,8.176576085614386,,0,0,0,8.176576085614386,3.6805097685453436,,0,0,0,3.6805097685453436,178.68400945902988,,0,0,0,178.68400945902988,54.272918712559665,,0,0,0,54.272918712559665,18.03556156577312,,0,0,0,18.03556156577312,119.71617754591519,,0,0,0,119.71617754591519
28,ARG,7.600528215723165,,0,0,0,7.600528215723165,4.062618357875458,,0,0,0,4.062618357875458,177.34272472868244,,0,0,0,177.34272472868244,58.42597192646797,,0,0,0,58.42597192646797,31.029235479781327,,0,0,0,31.029235479781327,116.76951632737817,,0,0,0,116.76951632737817
29,TRP,7.634683457459207,,0,0,0,7.634683457459207,4.554157621522922,,0,0,0,4.554157621522922,176.67398694329557,,0,0,0,176.67398694329557,58.80023647422022,,0,0,0,58.80023647422022,30.322492059657012,,0,0,0,30.322492059657012,115.8785139448274,,0,0,0,115.8785139448274
30,ASN,8.123774376900878,,0,0,0,8.123774376900878,4.429633141741593,,0,0,0,4.429633141741593,173.6547405507104,,0,0,0,173.6547405507104,52.5834207481685,,0,0,0,52.5834207481685,36.45500752645688,,0,0,0,36.45500752645688,120.19382495188701,,0,0,0,120.19382495188701
31,ALA,8.316069007437008,,0,0,0,8.316069007437008,4.4282335536075035,,0,0,0,4.4282335536075035,176.4811766076701,,0,0,0,176.4811766076701,51.46649865054945,,0,0,0,51.46649865054945,20.70221333722389,,0,0,0,20.70221333722389,125.92214808412143,,0,0,0,125.92214808412143
32,ALA,8.57564421056721,,0,0,0,8.57564421056721,4.074693940850816,,0,0,0,4.074693940850816,177.33470086465204,,0,0,0,177.33470086465204,54.555357944277944,,0,0,0,54.555357944277944,19.034253391480743,,0,0,0,19.034253391480743,125.801617459213,,0,0,0,125.801617459213
33,SER,7.6202517479742475,,0,0,0,7.6202517479742475,4.663647228776778,,0,0,0,4.663647228776778,174.89844053344987,,0,0,0,174.89844053344987,57.25286361356976,,0,0,0,57.25286361356976,65.37529588667998,,0,0,0,65.37529588667998,108.5397132074703,,0,0,0,108.5397132074703
34,SER,8.820633273104674,,0,0,0,8.820633273104674,4.304782051154401,,0,0,0,4.304782051154401,174.69717026920856,,0,0,0,174.69717026920856,60.895340235187035,,0,0,0,60.895340235187035,63.04891964123654,,0,0,0,63.04891964123654,117.23345924371185,,0,0,0,117.23345924371185
35,ASP,8.24097272046842,,0,0,0,8.24097272046842,4.715869847058497,,0,0,0,4.715869847058497,174.95122296086691,,0,0,0,174.95122296086691,54.657332334487734,,0,0,0,54.657332334487734,40.87553776860362,,0,0,0,40.87553776860362,119.5540177082029,,0,0,0,119.5540177082029
36,TRP,8.028587717010767,,0,0,0,8.028587717010767,5.009049195437895,,0,0,0,5.009049195437895,176.00397027894883,,0,0,0,176.00397027894883,56.556820803740706,,0,0,0,56.556820803740706,31.7891114466034,,0,0,0,31.7891114466034,121.10429882156731,,0,0,0,121.10429882156731
37,HIS,9.286307806438007,,0,0,0,9.286307806438007,4.889962897685647,,0,0,0,4.889962897685647,173.39448503262292,,0,0,0,173.39448503262292,54.90555859679765,,0,0,0,54.90555859679765,32.060426362526364,,0,0,0,32.060426362526364,117.52642727953157,,0,0,0,117.52642727953157
38,THR,8.499918496181596,,0,0,0,8.499918496181596,4.866896943423243,,0,0,0,4.866896943423243,174.68962420439004,,0,0,0,174.68962420439004,62.396894999872345,,0,0,0,62.396894999872345,69.25921030554446,,0,0,0,69.25921030554446,119.82890897657343,,0,0,0,119.82890897657343
39,THR,8.86941546997447,,0,0,0,8.86941546997447,4.312919338589189,,0,0,0,4.312919338589189,175.17932923968254,,0,0,0,175.17932923968254,61.797169710861354,,0,0,0,61.797169710861354,68.45324012213342,,0,0,0,68.45324012213342,119.95475934186368,,0,0,0,119.95475934186368
40,GLY,7.497936423304473,,0,0,0,7.497936423304473,4.104072176612277,,0,0,0,4.104072176612277,171.90003148818403,,0,0,0,171.90003148818403,45.52465148825064,,0,0,0,45.52465148825064,,,0,0,0,,109.01083865944611,,0,0,0,109.01083865944611
41,SER,8.452360351554002,,0,0,0,8.452360351554002,5.362800685553336,,0,0,0,5.362800685553336,173.03086863482073,,0,0,0,173.03086863482073,57.07413459959485,,0,0,0,57.07413459959485,65.2683726543068,,0,0,0,65.2683726543068,116.41409386441892,,0,0,0,116.41409386441892
42,ARG,8.90548750816406,,0,0,0,8.90548750816406,4.709083344483294,,0,0,0,4.709083344483294,174.2348600009879,,0,0,0,174.2348600009879,54.77428763428793,,0,0,0,54.77428763428793,33.63240485290265,,0,0,0,33.63240485290265,125.51433101431901,,0,0,0,125.51433101431901
43,VAL,8.691029522244422,,0,0,0,8.691029522244422,4.510428971506271,,0,0,0,4.510428971506271,174.72575485426796,,0,0,0,174.72575485426796,62.05166617344322,,0,0,0,62.05166617344322,34.63305477917083,,0,0,0,34.63305477917083,123.26490568249528,,0,0,0,123.26490568249528
44,ASP,8.798805511899213,,0,0,0,8.798805511899213,4.845174433732934,,0,0,0,4.845174433732934,175.87604987662894,,0,0,0,175.87604987662894,52.84917030735931,,0,0,0,52.84917030735931,41.49167198520924,,0,0,0,41.49167198520924,127.75176813796205,,0,0,0,127.75176813796205
45,LEU,8.33763628006993,,0,0,0,8.33763628006993,3.8870727416361417,,0,0,0,3.8870727416361417,175.68482663017537,,0,0,0,175.68482663017537,54.63866695034965,,0,0,0,54.63866695034965,40.95197340703186,,0,0,0,40.95197340703186,125.35665138246753,,0,0,0,125.35665138246753
46,VAL,8.128997974975025,,0,0,0,8.128997974975025,4.507654296092796,,0,0,0,4.507654296092796,175.9794873345266,,0,0,0,175.9794873345266,59.960883464818515,,0,0,0,59.960883464818515,34.659708597735595,,0,0,0,34.659708597735595,118.6834973953269,,0,0,0,118.6834973953269
47,VAL,8.290794383105782,,0,0,0,8.290794383105782,3.5276679354229104,,0,0,0,3.5276679354229104,177.14421302556335,,0,0,0,177.14421302556335,64.48407341589521,,0,0,0,64.48407341589521,31.42917353180708,,0,0,0,31.42917353180708,123.57924099856255,,0,0,0,123.57924099856255
48,GLY,9.209263311904762,,0,0,0,9.209263311904762,4.021329570268621,,0,0,0,4.021329570268621,174.95380002730604,,0,0,0,174.95380002730604,45.129072603774006,,0,0,0,45.129072603774006,,,0,0,0,,116.09231777117327,,0,0,0,116.09231777117327
49,GLY,8.346816409229659,,0,0,0,8.346816409229659,4.098488646858697,,0,0,0,4.098488646858697,172.98231831739926,,0,0,0,172.98231831739926,45.1102467518537,,0,0,0,45.1102467518537,,,0,0,0,,110.10643454394494,,0,0,0,110.10643454394494
50,ARG,8.420250656537908,,0,0,0,8.420250656537908,5.246007098784548,,0,0,0,5.246007098784548,175.57155567619048,,0,0,0,175.57155567619048,54.7803235521201,,0,0,0,54.7803235521201,33.37702561837607,,0,0,0,33.37702561837607,120.00429443220668,,0,0,0,120.00429443220668
51,PHE,8.564764042091243,,0,0,0,8.564764042091243,5.340129184981684,,0,0,0,5.340129184981684,173.67163107542459,,0,0,0,173.67163107542459,54.98671153795649,,0,0,0,54.98671153795649,42.85955147997558,,0,0,0,42.85955147997558,119.50991822495283,,0,0,0,119.50991822495283
52,CYS,8.925065806887558,,0,0,0,8.925065806887558,5.035597685708736,,0,0,0,5.035597685708736,172.6147812769619,,0,0,0,172.6147812769619,57.271320391147746,,0,0,0,57.271320391147746,29.753624511954712,,0,0,0,29.753624511954712,120.4583692041292,,0,0,0,120.4583692041292
53,HIS,9.189569410761461,,0,0,0,9.189569410761461,5.386396886790986,,0,0,0,5.386396886790986,173.96191478919968,,0,0,0,173.96191478919968,54.037745637756686,,0,0,0,54.037745637756686,31.907325418581422,,0,0,0,31.907325418581422,126.23063356466866,,0,0,0,126.23063356466866
54,HIS,9.031110020029969,,0,0,0,9.031110020029969,4.824888887456987,,0,0,0,4.824888887456987,173.69444113333333,,0,0,0,173.69444113333333,55.14301171015651,,0,0,0,55.14301171015651,29.886037623132424,,0,0,0,29.886037623132424,123.90227343620269,,0,0,0,123.90227343620269
55,MET,8.848345935941834,,0,0,0,8.848345935941834,4.7776505960372955,,0,0,0,4.7776505960372955,174.2700274247475,,0,0,0,174.2700274247475,54.45373627445887,,0,0,0,54.45373627445887,34.13968887677878,,0,0,0,34.13968887677878,126.41221359377845,,0,0,0,126.41221359377845
56,ALA,8.812602858685759,,0,0,0,8.812602858685759,4.938015774963926,,0,0,0,4.938015774963926,175.3900955623099,,0,0,0,175.3900955623099,50.26843000329115,,0,0,0,50.26843000329115,22.847149793428798,,0,0,0,22.847149793428798,124.71183806358641,,0,0,0,124.71183806358641
57,ALA,8.471362246309246,,0,0,0,8.471362246309246,3.7177336152902654,,0,0,0,3.7177336152902654,179.2990437153846,,0,0,0,179.2990437153846,51.94768976965257,,0,0,0,51.94768976965257,18.464780061771563,,0,0,0,18.464780061771563,123.79697209099234,,0,0,0,123.79697209099234
58,LYS,8.89160713176823,,0,0,0,8.89160713176823,3.817827115587191,,0,0,0,3.817827115587191,176.34911633724607,,0,0,0,176.34911633724607,58.715122602059054,,0,0,0,58.715122602059054,32.35318712828283,,0,0,0,32.35318712828283,122.99472395476747,,0,0,0,122.99472395476747
59,ASP,7.87121644073149,,0,0,0,7.87121644073149,4.502134728094128,,0,0,0,4.502134728094128,177.13082781411367,,0,0,0,177.13082781411367,53.42660807656788,,0,0,0,53.42660807656788,40.21096718000333,,0,0,0,40.21096718000333,116.18247954741925,,0,0,0,116.18247954741925
60,GLY,7.895930326423576,,0,0,0,7.895930326423576,3.8802428006576752,,0,0,0,3.8802428006576752,174.92519667847154,,0,0,0,174.92519667847154,46.06073539380064,,0,0,0,46.06073539380064,,,0,0,0,,109.82441506380842,,0,0,0,109.82441506380842
61,SER,8.280696895909646,,0,0,0,8.280696895909646,4.322745077700078,,0,0,0,4.322745077700078,174.49849696925853,,0,0,0,174.49849696925853,59.68631090816406,,0,0,0,59.68631090816406,63.93323835843601,,0,0,0,63.93323835843601,115.63636021185481,,0,0,0,115.63636021185481
62,ALA,7.830598022044621,,0,0,0,7.830598022044621,4.548655713591964,,0,0,0,4.548655713591964,175.94626823614163,,0,0,0,175.94626823614163,52.17052266703297,,0,0,0,52.17052266703297,20.96518692015762,,0,0,0,20.96518692015762,124.34245870798645,,0,0,0,124.34245870798645
63,GLY,8.411870125918526,,0,0,0,8.411870125918526,4.12925557089577,,0,0,0,4.12925557089577,172.37464061118328,,0,0,0,172.37464061118328,45.657158322016876,,0,0,0,45.657158322016876,,,0,0,0,,109.31480395202576,,0,0,0,109.31480395202576
64,PHE,9.02777026931402,,0,0,0,9.02777026931402,4.987883731113331,,0,0,0,4.987883731113331,173.02174665771452,,0,0,0,173.02174665771452,56.166412900444,,0,0,0,56.166412900444,41.25317375626596,,0,0,0,41.25317375626596,119.57041343625264,,0,0,0,119.57041343625264
65,ASP,8.752478693906093,,0,0,0,8.752478693906093,5.146204907664558,,0,0,0,5.146204907664558,175.36468654502164,,0,0,0,175.36468654502164,53.26971182912643,,0,0,0,53.26971182912643,41.41794634686425,,0,0,0,41.41794634686425,121.38295655888001,,0,0,0,121.38295655888001
66,PHE,9.236055195504496,,0,0,0,9.236055195504496,4.725234348712399,,0,0,0,4.725234348712399,174.4847286981796,,0,0,0,174.4847286981796,57.763500853463206,,0,0,0,57.763500853463206,39.73436743744034,,0,0,0,39.73436743744034,126.53104621423576,,0,0,0,126.53104621423576
67,THR,7.860258916050617,,0,0,0,7.860258916050617,4.854349319452769,,0,0,0,4.854349319452769,173.13606948131311,,0,0,0,173.13606948131311,59.24443073755133,,0,0,0,59.24443073755133,71.97292970594961,,0,0,0,71.97292970594961,119.28624100553336,,0,0,0,119.28624100553336
68,GLY,6.539172523432123,,0,0,0,6.539172523432123,3.734302757040181,,0,0,0,3.734302757040181,170.6448446976468,,0,0,0,170.6448446976468,46.10909896478521,,0,0,0,46.10909896478521,,,0,0,0,,108.14990995677655,,0,0,0,108.14990995677655
69,THR,8.801504501026752,,0,0,0,8.801504501026752,4.9638629737040745,,0,0,0,4.9638629737040745,174.22460942353757,,0,0,0,174.22460942353757,61.598984673398824,,0,0,0,61.598984673398824,70.80440759199134,,0,0,0,70.80440759199134,116.89176225128759,,0,0,0,116.89176225128759
70,PHE,9.366135223754023,,0,0,0,9.366135223754023,5.17952973959374,,0,0,0,5.17952973959374,176.27600749514374,,0,0,0,176.27600749514374,58.775567238439336,,0,0,0,58.775567238439336,39.794095464785215,,0,0,0,39.794095464785215,126.49650182099566,,0,0,0,126.49650182099566
71,THR,9.286281218831169,,0,0,0,9.286281218831169,4.519222468947719,,0,0,0,4.519222468947719,174.9737929553391,,0,0,0,174.9737929553391,62.67725029063159,,0,0,0,62.67725029063159,69.30618764976134,,0,0,0,69.30618764976134,115.74652062601842,,0,0,0,115.74652062601842
72,ARG,8.277221572183372,,0,0,0,8.277221572183372,4.718188321084471,,0,0,0,4.718188321084471,174.3386034483239,,0,0,0,174.3386034483239,55.59450780086025,,0,0,0,55.59450780086025,33.942962113802864,,0,0,0,33.942962113802864,121.57317592826618,,0,0,0,121.57317592826618
73,VAL,8.762798794644244,,0,0,0,8.762798794644244,4.669966838877789,,0,0,0,4.669966838877789,174.4423495816184,,0,0,0,174.4423495816184,62.30238188549784,,0,0,0,62.30238188549784,33.78493317654568,,0,0,0,33.78493317654568,125.19460542799423,,0,0,0,125.19460542799423
74,GLU,8.980613184426684,,0,0,0,8.980613184426684,4.552019868581418,,0,0,0,4.552019868581418,175.4466024702464,,0,0,0,175.4466024702464,55.11737907650683,,0,0,0,55.11737907650683,31.476672083694083,,0,0,0,31.476672083694083,127.55038013896105,,0,0,0,127.55038013896105
75,ALA,8.39947773994339,,0,0,0,8.39947773994339,3.6139955622932622,,0,0,0,3.6139955622932622,175.71426076948606,,0,0,0,175.71426076948606,51.70719966593961,,0,0,0,51.70719966593961,17.109775437440337,,0,0,0,17.109775437440337,127.86562382902098,,0,0,0,127.86562382902098
76,PRO,,,0,0,0,,3.3100337036574548,,0,0,0,3.3100337036574548,174.87043582480297,,0,0,0,174.87043582480297,63.88399203603618,,0,0,0,63.88399203603618,33.21238401807082,,0,0,0,33.21238401807082,,,0,0,0,
77,THR,7.934883261488512,,0,0,0,7.934883261488512,4.8043006055999555,,0,0,0,4.8043006055999555,175.20030468248416,,0,0,0,175.20030468248416,62.7573630592352,,0,0,0,62.7573630592352,69.7973246092352,,0,0,0,69.7973246092352,112.84019648892773,,0,0,0,112.84019648892773
78,ARG,7.939395962864913,,0,0,0,7.939395962864913,5.50888818974914,,0,0,0,5.50888818974914,173.83411509140305,,0,0,0,173.83411509140305,55.77840412787768,,0,0,0,55.77840412787768,34.00915937524697,,0,0,0,34.00915937524697,122.36409024406149,,0,0,0,122.36409024406149
79,LEU,9.415811614435563,,0,0,0,9.415811614435563,5.4352483916971925,,0,0,0,5.4352483916971925,174.6788266504551,,0,0,0,174.6788266504551,54.410306170346324,,0,0,0,54.410306170346324,46.623847821461865,,0,0,0,46.623847821461865,127.40769091679432,,0,0,0,127.40769091679432
80,SER,9.335262907736707,,0,0,0,9.335262907736707,5.574743976334776,,0,0,0,5.574743976334776,173.5227228660617,,0,0,0,173.5227228660617,57.090926107159504,,0,0,0,57.090926107159504,66.0281664509657,,0,0,0,66.0281664509657,121.58468979416139,,0,0,0,121.58468979416139
81,PHE,9.052946325518926,,0,0,0,9.052946325518926,5.534031606510157,,0,0,0,5.534031606510157,172.89830859235764,,0,0,0,172.89830859235764,55.80787262995893,,0,0,0,55.80787262995893,41.838113903812854,,0,0,0,41.838113903812854,120.19644413242868,,0,0,0,120.19644413242868
82,VAL,9.172158996109445,,0,0,0,9.172158996109445,5.0317577442002435,,0,0,0,5.0317577442002435,176.0128632319736,,0,0,0,176.0128632319736,60.53227686398601,,0,0,0,60.53227686398601,33.2940699050727,,0,0,0,33.2940699050727,121.32721654090355,,0,0,0,121.32721654090355
83,MET,9.281672653341102,,0,0,0,9.281672653341102,4.601376542296592,,0,0,0,4.601376542296592,177.9165360414863,,0,0,0,177.9165360414863,55.75661602665112,,0,0,0,55.75661602665112,33.146751046220444,,0,0,0,33.146751046220444,126.03464865415695,,0,0,0,126.03464865415695
84,ASP,8.551209016039516,,0,0,0,8.551209016039516,4.350792735203686,,0,0,0,4.350792735203686,176.1474413385226,,0,0,0,176.1474413385226,56.94496982648463,,0,0,0,56.94496982648463,40.37002523409369,,0,0,0,40.37002523409369,122.0585712428516,,0,0,0,122.0585712428516
85,ASP,7.86284794004884,,0,0,0,7.86284794004884,4.519128536419136,,0,0,0,4.519128536419136,176.943811877023,,0,0,0,176.943811877023,53.54515102001332,,0,0,0,53.54515102001332,40.1919376943723,,0,0,0,40.1919376943723,116.2115972873127,,0,0,0,116.2115972873127
86,GLY,8.1865474996115,,0,0,0,8.1865474996115,3.9568443013375516,,0,0,0,3.9568443013375516,174.82250711329226,,0,0,0,174.82250711329226,45.268563872693974,,0,0,0,45.268563872693974,,,0,0,0,,108.6854644100011,,0,0,0,108.6854644100011
87,ARG,7.772808098745699,,0,0,0,7.772808098745699,4.313512777078477,,0,0,0,4.313512777078477,175.80723324240205,,0,0,0,175.80723324240205,56.562531134243535,,0,0,0,56.562531134243535,31.267003265140414,,0,0,0,31.267003265140414,121.27608245312466,,0,0,0,121.27608245312466
88,GLU,8.955375663098014,,0,0,0,8.955375663098014,4.923619231968032,,0,0,0,4.923619231968032,175.48519358111886,,0,0,0,175.48519358111886,55.96241628368853,,0,0,0,55.96241628368853,31.81743023694639,,0,0,0,31.81743023694639,122.12709982626818,,0,0,0,122.12709982626818
89,VAL,8.774356324586524,,0,0,0,8.774356324586524,4.674407222039072,,0,0,0,4.674407222039072,173.58499090120992,,0,0,0,173.58499090120992,60.38240933812854,,0,0,0,60.38240933812854,34.393444922743925,,0,0,0,34.393444922743925,122.94354585594961,,0,0,0,122.94354585594961