RESNUM,RESNAME,H_X,H_Y,H_BEST_REF_SCORE,H_BEST_REF_COV,H_BEST_REF_MATCH,H_UCBShift,HA_X,HA_Y,HA_BEST_REF_SCORE,HA_BEST_REF_COV,HA_BEST_REF_MATCH,HA_UCBShift,C_X,C_Y,C_BEST_REF_SCORE,C_BEST_REF_COV,C_BEST_REF_MATCH,C_UCBShift,CA_X,CA_Y,CA_BEST_REF_SCORE,CA_BEST_REF_COV,CA_BEST_REF_MATCH,CA_UCBShift,CB_X,CB_Y,CB_BEST_REF_SCORE,CB_BEST_REF_COV,CB_BEST_REF_MATCH,CB_UCBShift,N_X,N_Y,N_BEST_REF_SCORE,N_BEST_REF_COV,N_BEST_REF_MATCH,N_UCBShift
1,MET,8.339202328177377,,0,0,0,8.339202328177377,4.418814156868132,,0,0,0,4.418814156868132,175.34930425707626,,0,0,0,175.34930425707626,55.24331976313686,,0,0,0,55.24331976313686,32.971739155794204,,0,0,0,32.971739155794204,121.13418112111776,,0,0,0,121.13418112111776
2,GLY,8.388639770751471,,0,0,0,8.388639770751471,3.92428594434177,,0,0,0,3.92428594434177,174.28619256013985,,0,0,0,174.28619256013985,44.903994482029084,,0,0,0,44.903994482029084,,,0,0,0,,110.58609178729604,,0,0,0,110.58609178729604
3,HIS,8.621983233150184,,0,0,0,8.621983233150184,4.423929726379176,,0,0,0,4.423929726379176,175.2037140075036,,0,0,0,175.2037140075036,56.007806257609055,,0,0,0,56.007806257609055,30.002150276229326,,0,0,0,30.002150276229326,119.96352245472306,,0,0,0,119.96352245472306
4,HIS,8.568019335841935,,0,0,0,8.568019335841935,4.708570199761349,,0,0,0,4.708570199761349,174.60874135445664,,0,0,0,174.60874135445664,55.59715961831502,,0,0,0,55.59715961831502,29.32737932841603,,0,0,0,29.32737932841603,121.39386754891775,,0,0,0,121.39386754891775
5,HIS,8.615507990759241,,0,0,0,8.615507990759241,4.464316551121101,,0,0,0,4.464316551121101,174.85603542822176,,0,0,0,174.85603542822176,55.67863521881452,,0,0,0,55.67863521881452,29.096109187479186,,0,0,0,29.096109187479186,121.44373375795317,,0,0,0,121.44373375795317
6,HIS,8.41063358928294,,0,0,0,8.41063358928294,4.385698549889,,0,0,0,4.385698549889,174.5391797559718,,0,0,0,174.5391797559718,56.212698486901985,,0,0,0,56.212698486901985,29.32695457049062,,0,0,0,29.32695457049062,121.61820886435787,,0,0,0,121.61820886435787
7,HIS,8.471133364957264,,0,0,0,8.471133364957264,4.33893970964591,,0,0,0,4.33893970964591,174.6406966564491,,0,0,0,174.6406966564491,55.98169513248973,,0,0,0,55.98169513248973,28.92478950855256,,0,0,0,28.92478950855256,122.35923212748362,,0,0,0,122.35923212748362
8,HIS,8.288744412309912,,0,0,0,8.288744412309912,4.355936777261627,,0,0,0,4.355936777261627,174.53702750343544,,0,0,0,174.53702750343544,56.58359371113331,,0,0,0,56.58359371113331,29.242753156260406,,0,0,0,29.242753156260406,121.65881844368964,,0,0,0,121.65881844368964
9,SER,8.321358811910313,,0,0,0,8.321358811910313,4.448442038522589,,0,0,0,4.448442038522589,174.64101404677544,,0,0,0,174.64101404677544,58.13034992967587,,0,0,0,58.13034992967587,63.60409867468087,,0,0,0,63.60409867468087,119.0511418583694,,0,0,0,119.0511418583694
10,HIS,8.439888937307137,,0,0,0,8.439888937307137,4.582406875857476,,0,0,0,4.582406875857476,174.57105658650238,,0,0,0,174.57105658650238,54.9638755055278,,0,0,0,54.9638755055278,28.66539129243534,,0,0,0,28.66539129243534,122.91162141253746,,0,0,0,122.91162141253746
11,MET,8.157834412620712,,0,0,0,8.157834412620712,4.6813755786879785,,0,0,0,4.6813755786879785,174.25335268522588,,0,0,0,174.25335268522588,53.69427723704074,,0,0,0,53.69427723704074,32.533265244494395,,0,0,0,32.533265244494395,123.8940850432623,,0,0,0,123.8940850432623
12,PRO,,,0,0,0,,4.50447228000888,,0,0,0,4.50447228000888,176.6107048928627,,0,0,0,176.6107048928627,62.74203038034188,,0,0,0,62.74203038034188,31.794747704267955,,0,0,0,31.794747704267955,,,0,0,0,
13,LYS,8.39043674136419,,0,0,0,8.39043674136419,4.263276026556777,,0,0,0,4.263276026556777,176.41924536961372,,0,0,0,176.41924536961372,56.080840847069595,,0,0,0,56.080840847069595,32.85602050920191,,0,0,0,32.85602050920191,123.22259099769121,,0,0,0,123.22259099769121
14,SER,8.216139015634365,,0,0,0,8.216139015634365,4.570879800402375,,0,0,0,4.570879800402375,173.00520130860806,,0,0,0,173.00520130860806,56.28332273149073,,0,0,0,56.28332273149073,63.48050913997114,,0,0,0,63.48050913997114,119.04688119536019,,0,0,0,119.04688119536019
15,PRO,,,0,0,0,,4.468566747868798,,0,0,0,4.468566747868798,177.15386050285272,,0,0,0,177.15386050285272,63.2848008067821,,0,0,0,63.2848008067821,31.85405801956377,,0,0,0,31.85405801956377,,,0,0,0,
16,GLN,8.445517599950051,,0,0,0,8.445517599950051,4.348855366533466,,0,0,0,4.348855366533466,176.07309722762793,,0,0,0,176.07309722762793,55.69475763202908,,0,0,0,55.69475763202908,29.258923718437117,,0,0,0,29.258923718437117,121.74608267491398,,0,0,0,121.74608267491398
17,LYS,8.394784150538351,,0,0,0,8.394784150538351,4.479309990917415,,0,0,0,4.479309990917415,174.99782100135977,,0,0,0,174.99782100135977,54.65317487834388,,0,0,0,54.65317487834388,32.431323089022094,,0,0,0,32.431323089022094,124.19455955497834,,0,0,0,124.19455955497834
18,PRO,,,0,0,0,,4.410870902553002,,0,0,0,4.410870902553002,176.02727650335223,,0,0,0,176.02727650335223,63.416847502442,,0,0,0,63.416847502442,32.17813489099789,,0,0,0,32.17813489099789,,,0,0,0,
19,ILE,8.210202474003774,,0,0,0,8.210202474003774,5.135985506260407,,0,0,0,5.135985506260407,174.66635414759685,,0,0,0,174.66635414759685,59.21437702011877,,0,0,0,59.21437702011877,41.73837369466089,,0,0,0,41.73837369466089,119.27843194164724,,0,0,0,119.27843194164724
20,VAL,9.042343823354424,,0,0,0,9.042343823354424,4.493906788261738,,0,0,0,4.493906788261738,174.39757035515595,,0,0,0,174.39757035515595,60.80379063300033,,0,0,0,60.80379063300033,34.46146004350649,,0,0,0,34.46146004350649,121.46808793702964,,0,0,0,121.46808793702964
21,ARG,8.644033633732935,,0,0,0,8.644033633732935,4.708184998901099,,0,0,0,4.708184998901099,174.68465977117884,,0,0,0,174.68465977117884,55.567964435914085,,0,0,0,55.567964435914085,31.74770604947275,,0,0,0,31.74770604947275,126.93664592483071,,0,0,0,126.93664592483071
22,VAL,8.720836885087135,,0,0,0,8.720836885087135,4.722333464757464,,0,0,0,4.722333464757464,174.52089674098679,,0,0,0,174.52089674098679,60.34084447659563,,0,0,0,60.34084447659563,34.42031490571095,,0,0,0,34.42031490571095,124.95814907195583,,0,0,0,124.95814907195583
23,PHE,9.326363442096794,,0,0,0,9.326363442096794,4.902568971756022,,0,0,0,4.902568971756022,174.85293704134756,,0,0,0,174.85293704134756,57.948573097269396,,0,0,0,57.948573097269396,40.39678157777223,,0,0,0,40.39678157777223,126.69271734171383,,0,0,0,126.69271734171383
24,LEU,9.048295511316462,,0,0,0,9.048295511316462,5.096214940737041,,0,0,0,5.096214940737041,174.73329447112886,,0,0,0,174.73329447112886,51.77002262730603,,0,0,0,51.77002262730603,43.00763574749695,,0,0,0,43.00763574749695,123.51699901620046,,0,0,0,123.51699901620046
25,PRO,,,0,0,0,,4.375868786652237,,0,0,0,4.375868786652237,176.3397356854701,,0,0,0,176.3397356854701,63.60869108603618,,0,0,0,63.60869108603618,32.08874806312576,,0,0,0,32.08874806312576,,,0,0,0,
26,ASN,8.578601422527473,,0,0,0,8.578601422527473,4.5085653489788,,0,0,0,4.5085653489788,175.19054385396268,,0,0,0,175.19054385396268,53.87996812841603,,0,0,0,53.87996812841603,38.04867504185259,,0,0,0,38.04867504185259,115.78588214343435,,0,0,0,115.78588214343435
27,LYS,8.348450243395492,,0,0,0,8.348450243395492,3.9010614744033743,,0,0,0,3.9010614744033743,175.17115054969474,,0,0,0,175.17115054969474,57.72688295528361,,0,0,0,57.72688295528361,30.111013501082255,,0,0,0,30.111013501082255,110.5833597985015,,0,0,0,110.5833597985015
28,GLN,7.936001445637696,,0,0,0,7.936001445637696,4.682884991031191,,0,0,0,4.682884991031191,175.43481860467864,,0,0,0,175.43481860467864,54.8372527975691,,0,0,0,54.8372527975691,31.712164614774114,,0,0,0,31.712164614774114,118.606315044117,,0,0,0,118.606315044117
29,ARG,8.449544245765345,,0,0,0,8.449544245765345,5.240553185342436,,0,0,0,5.240553185342436,174.91234711465202,,0,0,0,174.91234711465202,54.75401233568098,,0,0,0,54.75401233568098,33.57783594484405,,0,0,0,33.57783594484405,119.4595790489233,,0,0,0,119.4595790489233
30,THR,8.85496647892108,,0,0,0,8.85496647892108,4.637823941053391,,0,0,0,4.637823941053391,172.48427569978352,,0,0,0,172.48427569978352,60.24716476603951,,0,0,0,60.24716476603951,70.73052294028194,,0,0,0,70.73052294028194,115.49062403855034,,0,0,0,115.49062403855034
31,VAL,8.323527393645243,,0,0,0,8.323527393645243,4.865717780819181,,0,0,0,4.865717780819181,175.54405526028972,,0,0,0,175.54405526028972,61.127238014052615,,0,0,0,61.127238014052615,34.31445035781441,,0,0,0,34.31445035781441,122.2985022459485,,0,0,0,122.2985022459485
32,VAL,8.72854265077145,,0,0,0,8.72854265077145,4.662094224037074,,0,0,0,4.662094224037074,173.45862082094018,,0,0,0,173.45862082094018,57.56298695375735,,0,0,0,57.56298695375735,34.314064112420915,,0,0,0,34.314064112420915,123.96912488623599,,0,0,0,123.96912488623599
33,PRO,,,0,0,0,,4.6153885346209345,,0,0,0,4.6153885346209345,175.9531261989455,,0,0,0,175.9531261989455,62.35225211097791,,0,0,0,62.35225211097791,31.964685015151517,,0,0,0,31.964685015151517,,,0,0,0,
34,ALA,8.364540483494284,,0,0,0,8.364540483494284,4.382444964052614,,0,0,0,4.382444964052614,176.42477136544014,,0,0,0,176.42477136544014,51.0649929059385,,0,0,0,51.0649929059385,18.00567606554002,,0,0,0,18.00567606554002,126.7272688933622,,0,0,0,126.7272688933622
35,ARG,7.90322588924964,,0,0,0,7.90322588924964,4.489487917549117,,0,0,0,4.489487917549117,176.07549810995673,,0,0,0,176.07549810995673,55.43858471013431,,0,0,0,55.43858471013431,31.08828360917416,,0,0,0,31.08828360917416,120.8435216001554,,0,0,0,120.8435216001554
36,CYS,8.526231907004107,,0,0,0,8.526231907004107,4.1900994007881005,,0,0,0,4.1900994007881005,176.30404966006216,,0,0,0,176.30404966006216,59.46626094907315,,0,0,0,59.46626094907315,27.316313325141525,,0,0,0,27.316313325141525,122.11847293131868,,0,0,0,122.11847293131868
37,GLY,9.080446919003219,,0,0,0,9.080446919003219,3.893052845487844,,0,0,0,3.893052845487844,173.83981387903208,,0,0,0,173.83981387903208,45.46576757405928,,0,0,0,45.46576757405928,,,0,0,0,,111.5261830539738,,0,0,0,111.5261830539738
38,VAL,7.37880526056166,,0,0,0,7.37880526056166,4.251254843761793,,0,0,0,4.251254843761793,175.76287486119438,,0,0,0,175.76287486119438,61.524700953313356,,0,0,0,61.524700953313356,33.164288286363636,,0,0,0,33.164288286363636,121.82925718098014,,0,0,0,121.82925718098014
39,THR,8.555717936352536,,0,0,0,8.555717936352536,4.951149680741481,,0,0,0,4.951149680741481,176.82447386646132,,0,0,0,176.82447386646132,60.511209208036405,,0,0,0,60.511209208036405,71.6838688960595,,0,0,0,71.6838688960595,117.28272533721278,,0,0,0,117.28272533721278
40,VAL,9.067985788078587,,0,0,0,9.067985788078587,3.4582795052086803,,0,0,0,3.4582795052086803,177.70457427691198,,0,0,0,177.70457427691198,67.26880033808415,,0,0,0,67.26880033808415,31.457269705333555,,0,0,0,31.457269705333555,123.45217961742702,,0,0,0,123.45217961742702
41,ARG,8.647404815795316,,0,0,0,8.647404815795316,3.925914421153846,,0,0,0,3.925914421153846,178.14200070899656,,0,0,0,178.14200070899656,60.332052608258415,,0,0,0,60.332052608258415,30.139838236602284,,0,0,0,30.139838236602284,119.20160305293595,,0,0,0,119.20160305293595
42,ASP,8.259964354684204,,0,0,0,8.259964354684204,4.407884556382506,,0,0,0,4.407884556382506,178.84551089820735,,0,0,0,178.84551089820735,57.10883492461428,,0,0,0,57.10883492461428,40.28540315743146,,0,0,0,40.28540315743146,119.09243958787324,,0,0,0,119.09243958787324
43,SER,8.208883010961262,,0,0,0,8.208883010961262,4.279730017379842,,0,0,0,4.279730017379842,176.29781468043623,,0,0,0,176.29781468043623,61.24532779005438,,0,0,0,61.24532779005438,63.3399308493118,,0,0,0,63.3399308493118,115.22243311320346,,0,0,0,115.22243311320346
44,LEU,8.276379882617382,,0,0,0,8.276379882617382,4.238019602869353,,0,0,0,4.238019602869353,179.0513020535853,,0,0,0,179.0513020535853,55.865272235303586,,0,0,0,55.865272235303586,42.55587652691197,,0,0,0,42.55587652691197,119.10794717700078,,0,0,0,119.10794717700078
45,LYS,8.141488679581528,,0,0,0,8.141488679581528,3.7067756355006107,,0,0,0,3.7067756355006107,177.43572383055277,,0,0,0,177.43572383055277,60.54124713460429,,0,0,0,60.54124713460429,32.330226223931625,,0,0,0,32.330226223931625,122.27585517383727,,0,0,0,122.27585517383727
46,LYS,8.41989035088245,,0,0,0,8.41989035088245,4.123862681030081,,0,0,0,4.123862681030081,178.88023997423687,,0,0,0,178.88023997423687,59.24344176627262,,0,0,0,59.24344176627262,32.207717853130205,,0,0,0,32.207717853130205,117.97737684616494,,0,0,0,117.97737684616494
47,ALA,7.798167131057831,,0,0,0,7.798167131057831,4.134499591391942,,0,0,0,4.134499591391942,179.94215554905097,,0,0,0,179.94215554905097,54.79029479459429,,0,0,0,54.79029479459429,18.418660211732714,,0,0,0,18.418660211732714,122.65993729383949,,0,0,0,122.65993729383949
48,LEU,8.683303912309912,,0,0,0,8.683303912309912,4.033890496991897,,0,0,0,4.033890496991897,179.50080712428127,,0,0,0,179.50080712428127,57.88950053596403,,0,0,0,57.88950053596403,41.49843991385281,,0,0,0,41.49843991385281,118.67954404113664,,0,0,0,118.67954404113664
49,MET,8.366126425924076,,0,0,0,8.366126425924076,4.105809007098457,,0,0,0,4.105809007098457,179.65553281463536,,0,0,0,179.65553281463536,58.6907777544289,,0,0,0,58.6907777544289,32.60943997743922,,0,0,0,32.60943997743922,119.82646793549783,,0,0,0,119.82646793549783
50,MET,8.232361937518037,,0,0,0,8.232361937518037,4.221701991336441,,0,0,0,4.221701991336441,177.31174225602732,,0,0,0,177.31174225602732,57.56534668608613,,0,0,0,57.56534668608613,32.42308854149739,,0,0,0,32.42308854149739,117.78288161012875,,0,0,0,117.78288161012875
51,ARG,7.646003372710623,,0,0,0,7.646003372710623,4.520912778682429,,0,0,0,4.520912778682429,176.39328669891776,,0,0,0,176.39328669891776,55.69193992785548,,0,0,0,55.69193992785548,30.975487754168054,,0,0,0,30.975487754168054,117.89526996469641,,0,0,0,117.89526996469641
52,GLY,7.912297648889999,,0,0,0,7.912297648889999,3.9643102931984675,,0,0,0,3.9643102931984675,174.50654353441558,,0,0,0,174.50654353441558,46.08132024505495,,0,0,0,46.08132024505495,,,0,0,0,,108.99919389084803,,0,0,0,108.99919389084803
53,LEU,7.902203613258964,,0,0,0,7.902203613258964,4.5740214891719395,,0,0,0,4.5740214891719395,175.8238950662615,,0,0,0,175.8238950662615,54.27066518332224,,0,0,0,54.27066518332224,43.14900888872239,,0,0,0,43.14900888872239,120.20521353808414,,0,0,0,120.20521353808414
54,ILE,7.979720530808081,,0,0,0,7.979720530808081,4.477365348121323,,0,0,0,4.477365348121323,175.55380328510378,,0,0,0,175.55380328510378,57.722757954090355,,0,0,0,57.722757954090355,39.39871295233101,,0,0,0,39.39871295233101,119.4896998950383,,0,0,0,119.4896998950383
55,PRO,,,0,0,0,,3.2772627162587415,,0,0,0,3.2772627162587415,178.26041469567656,,0,0,0,178.26041469567656,65.2987529034188,,0,0,0,65.2987529034188,30.30395325972361,,0,0,0,30.30395325972361,,,0,0,0,
56,GLU,9.290469781995782,,0,0,0,9.290469781995782,3.950160438250639,,0,0,0,3.950160438250639,177.54066077646797,,0,0,0,177.54066077646797,58.40352292933178,,0,0,0,58.40352292933178,28.696763044577644,,0,0,0,28.696763044577644,116.23523006716617,,0,0,0,116.23523006716617
57,CYS,7.68912935989566,,0,0,0,7.68912935989566,4.618869041317016,,0,0,0,4.618869041317016,173.92623704034852,,0,0,0,173.92623704034852,58.69305155333,,0,0,0,58.69305155333,28.522273606549007,,0,0,0,28.522273606549007,116.04322409596514,,0,0,0,116.04322409596514
58,CYS,7.869666963969364,,0,0,0,7.869666963969364,5.683399438855587,,0,0,0,5.683399438855587,172.76869632683426,,0,0,0,172.76869632683426,58.230589122544124,,0,0,0,58.230589122544124,32.38076242653458,,0,0,0,32.38076242653458,118.58937772513042,,0,0,0,118.58937772513042
59,ALA,9.02348561995782,,0,0,0,9.02348561995782,4.7973484933899435,,0,0,0,4.7973484933899435,174.93612806706628,,0,0,0,174.93612806706628,50.30102418395494,,0,0,0,50.30102418395494,22.728934993439893,,0,0,0,22.728934993439893,122.99680264321233,,0,0,0,122.99680264321233
60,VAL,7.868408839382839,,0,0,0,7.868408839382839,4.660423423509823,,0,0,0,4.660423423509823,174.32031470531692,,0,0,0,174.32031470531692,60.67804058388833,,0,0,0,60.67804058388833,33.14228126400821,,0,0,0,33.14228126400821,120.41176619357864,,0,0,0,120.41176619357864
61,TYR,9.275584937218337,,0,0,0,9.275584937218337,5.236810365867466,,0,0,0,5.236810365867466,174.63704941192142,,0,0,0,174.63704941192142,56.193944637529135,,0,0,0,56.193944637529135,42.21850699771339,,0,0,0,42.21850699771339,125.52510464323454,,0,0,0,125.52510464323454
62,ARG,9.31987016940837,,0,0,0,9.31987016940837,5.237459462298812,,0,0,0,5.237459462298812,174.73141364855147,,0,0,0,174.73141364855147,54.429046854967254,,0,0,0,54.429046854967254,33.20213747370962,,0,0,0,33.20213747370962,121.92142964659784,,0,0,0,121.92142964659784
63,ILE,8.587485497330448,,0,0,0,8.587485497330448,4.758249282761683,,0,0,0,4.758249282761683,176.07871801869797,,0,0,0,176.07871801869797,59.429642516822064,,0,0,0,59.429642516822064,37.806835964840715,,0,0,0,37.806835964840715,121.9424944981796,,0,0,0,121.9424944981796
64,GLN,8.748638006182706,,0,0,0,8.748638006182706,4.560657841397491,,0,0,0,4.560657841397491,175.75658892317682,,0,0,0,175.75658892317682,55.03283238748474,,0,0,0,55.03283238748474,31.405349114929514,,0,0,0,31.405349114929514,127.88603280722054,,0,0,0,127.88603280722054
65,ASP,9.38997115970696,,0,0,0,9.38997115970696,4.298035842576867,,0,0,0,4.298035842576867,175.59149707396492,,0,0,0,175.59149707396492,55.33957405940171,,0,0,0,55.33957405940171,40.46623497005772,,0,0,0,40.46623497005772,127.79531757380953,,0,0,0,127.79531757380953
66,GLY,8.576266736396937,,0,0,0,8.576266736396937,3.8393156574730827,,0,0,0,3.8393156574730827,173.60795331814853,,0,0,0,173.60795331814853,45.435249650466204,,0,0,0,45.435249650466204,,,0,0,0,,103.58812527398712,,0,0,0,103.58812527398712
67,GLU,7.888857056454657,,0,0,0,7.888857056454657,4.498045922649572,,0,0,0,4.498045922649572,175.33818225158728,,0,0,0,175.33818225158728,54.819769346903094,,0,0,0,54.819769346903094,32.113991151481855,,0,0,0,32.113991151481855,120.85439668983794,,0,0,0,120.85439668983794
68,LYS,8.644036807736708,,0,0,0,8.644036807736708,4.645160581762681,,0,0,0,4.645160581762681,175.91655906030635,,0,0,0,175.91655906030635,56.18366435668776,,0,0,0,56.18366435668776,33.089569289438344,,0,0,0,33.089569289438344,123.94222580662115,,0,0,0,123.94222580662115
69,LYS,8.829385771855922,,0,0,0,8.829385771855922,4.9350375898989896,,0,0,0,4.9350375898989896,173.71507405974026,,0,0,0,173.71507405974026,52.81753119390609,,0,0,0,52.81753119390609,34.29773479662005,,0,0,0,34.29773479662005,125.025697308103,,0,0,0,125.025697308103
70,PRO,,,0,0,0,,4.504484658580308,,0,0,0,4.504484658580308,176.58418762096238,,0,0,0,176.58418762096238,62.67773043106338,,0,0,0,62.67773043106338,32.22738674845155,,0,0,0,32.22738674845155,,,0,0,0,
71,ILE,8.416664938245088,,0,0,0,8.416664938245088,4.320436148662449,,0,0,0,4.320436148662449,175.65934288971584,,0,0,0,175.65934288971584,59.08307445111,,0,0,0,59.08307445111,39.25792682265512,,0,0,0,39.25792682265512,122.09900711928627,,0,0,0,122.09900711928627
72,GLY,8.540647453973804,,0,0,0,8.540647453973804,4.032049956870907,,0,0,0,4.032049956870907,175.80112385133756,,0,0,0,175.80112385133756,44.951673255439005,,0,0,0,44.951673255439005,,,0,0,0,,115.6385494963259,,0,0,0,115.6385494963259
73,TRP,8.65971698969919,,0,0,0,8.65971698969919,4.305766621217671,,0,0,0,4.305766621217671,175.49014607902652,,0,0,0,175.49014607902652,59.909665563536464,,0,0,0,59.909665563536464,29.520220204456656,,0,0,0,29.520220204456656,122.39048592824398,,0,0,0,122.39048592824398
74,ASP,8.343614136391386,,0,0,0,8.343614136391386,4.651816961355311,,0,0,0,4.651816961355311,176.24536095864693,,0,0,0,176.24536095864693,53.6195165968254,,0,0,0,53.6195165968254,40.361618889105344,,0,0,0,40.361618889105344,114.5042650999445,,0,0,0,114.5042650999445
75,THR,7.522976283100234,,0,0,0,7.522976283100234,3.9246697714008207,,0,0,0,3.9246697714008207,174.04115908767898,,0,0,0,174.04115908767898,64.55917983550893,,0,0,0,64.55917983550893,69.7489051080919,,0,0,0,69.7489051080919,117.97349318894993,,0,0,0,117.97349318894993
76,ASP,7.709053934382284,,0,0,0,7.709053934382284,4.379361089038739,,0,0,0,4.379361089038739,177.3988844739927,,0,0,0,177.3988844739927,54.16363582755578,,0,0,0,54.16363582755578,40.544548571922526,,0,0,0,40.544548571922526,126.81510784837941,,0,0,0,126.81510784837941
77,ILE,8.887347867266067,,0,0,0,8.887347867266067,3.9411882595598846,,0,0,0,3.9411882595598846,176.89743160969587,,0,0,0,176.89743160969587,62.99757382683428,,0,0,0,62.99757382683428,38.18231621877567,,0,0,0,38.18231621877567,125.71917312069598,,0,0,0,125.71917312069598
78,SER,8.55750802988678,,0,0,0,8.55750802988678,4.20266708946609,,0,0,0,4.20266708946609,175.95550069025973,,0,0,0,175.95550069025973,60.79500580815851,,0,0,0,60.79500580815851,63.16011134524364,,0,0,0,63.16011134524364,116.25074481460207,,0,0,0,116.25074481460207
79,TRP,7.5081413999112,,0,0,0,7.5081413999112,4.603366251048952,,0,0,0,4.603366251048952,176.8619440435731,,0,0,0,176.8619440435731,58.433100543006994,,0,0,0,58.433100543006994,28.454094945987347,,0,0,0,28.454094945987347,121.72971001694971,,0,0,0,121.72971001694971
80,LEU,7.636269308696859,,0,0,0,7.636269308696859,4.532094095987346,,0,0,0,4.532094095987346,176.79003673879453,,0,0,0,176.79003673879453,54.284822738938836,,0,0,0,54.284822738938836,41.83419711508491,,0,0,0,41.83419711508491,117.97438493044733,,0,0,0,117.97438493044733
81,THR,7.106464351198802,,0,0,0,7.106464351198802,3.9982376131701627,,0,0,0,3.9982376131701627,175.87782712461427,,0,0,0,175.87782712461427,65.2764936925408,,0,0,0,65.2764936925408,68.73805723197913,,0,0,0,68.73805723197913,117.20330742557442,,0,0,0,117.20330742557442
82,GLY,9.009432868453768,,0,0,0,9.009432868453768,3.989156726221001,,0,0,0,3.989156726221001,174.6828324035409,,0,0,0,174.6828324035409,45.5838064457043,,0,0,0,45.5838064457043,,,0,0,0,,114.98638036031745,,0,0,0,114.98638036031745
83,GLU,8.065950901781552,,0,0,0,8.065950901781552,4.482821765867466,,0,0,0,4.482821765867466,174.940866073865,,0,0,0,174.940866073865,56.79182539439449,,0,0,0,56.79182539439449,31.26094243162393,,0,0,0,31.26094243162393,121.42108632195027,,0,0,0,121.42108632195027
84,GLU,8.62301011019536,,0,0,0,8.62301011019536,5.338242792041292,,0,0,0,5.338242792041292,176.0354435434843,,0,0,0,176.0354435434843,55.27242834295704,,0,0,0,55.27242834295704,31.368296385764236,,0,0,0,31.368296385764236,119.2345310488567,,0,0,0,119.2345310488567
85,LEU,9.132762153263403,,0,0,0,9.132762153263403,5.294782734404485,,0,0,0,5.294782734404485,175.68461801142746,,0,0,0,175.68461801142746,53.083280217793316,,0,0,0,53.083280217793316,44.47276421736596,,0,0,0,44.47276421736596,124.44454028283938,,0,0,0,124.44454028283938
86,HIS,9.38742408829504,,0,0,0,9.38742408829504,5.334394777494728,,0,0,0,5.334394777494728,174.25109293463203,,0,0,0,174.25109293463203,55.08881229094794,,0,0,0,55.08881229094794,32.45828234009879,,0,0,0,32.45828234009879,120.2052889867355,,0,0,0,120.2052889867355
87,VAL,8.921401962903762,,0,0,0,8.921401962903762,5.075530845904096,,0,0,0,5.075530845904096,175.3053321938284,,0,0,0,175.3053321938284,61.13798656898102,,0,0,0,61.13798656898102,33.198502866416916,,0,0,0,33.198502866416916,124.63808532727828,,0,0,0,124.63808532727828
88,GLU,9.162070679387279,,0,0,0,9.162070679387279,4.771165615301365,,0,0,0,4.771165615301365,175.37966077079585,,0,0,0,175.37966077079585,54.3415762029526,,0,0,0,54.3415762029526,33.25710229721945,,0,0,0,33.25710229721945,126.83729955193141,,0,0,0,126.83729955193141
89,VAL,8.683356166006215,,0,0,0,8.683356166006215,4.626042952819402,,0,0,0,4.626042952819402,176.42064585983462,,0,0,0,176.42064585983462,62.2382569942613,,0,0,0,62.2382569942613,32.34615091806527,,0,0,0,32.34615091806527,123.21020611265402,,0,0,0,123.21020611265402
90,LEU,8.751851492901544,,0,0,0,8.751851492901544,4.470187351703852,,0,0,0,4.470187351703852,178.449905838567,,0,0,0,178.449905838567,54.59506151318681,,0,0,0,54.59506151318681,42.11261538242313,,0,0,0,42.11261538242313,129.11141073223996,,0,0,0,129.11141073223996