RESNUM,RESNAME,H_X,H_Y,H_BEST_REF_SCORE,H_BEST_REF_COV,H_BEST_REF_MATCH,H_UCBShift,HA_X,HA_Y,HA_BEST_REF_SCORE,HA_BEST_REF_COV,HA_BEST_REF_MATCH,HA_UCBShift,C_X,C_Y,C_BEST_REF_SCORE,C_BEST_REF_COV,C_BEST_REF_MATCH,C_UCBShift,CA_X,CA_Y,CA_BEST_REF_SCORE,CA_BEST_REF_COV,CA_BEST_REF_MATCH,CA_UCBShift,CB_X,CB_Y,CB_BEST_REF_SCORE,CB_BEST_REF_COV,CB_BEST_REF_MATCH,CB_UCBShift,N_X,N_Y,N_BEST_REF_SCORE,N_BEST_REF_COV,N_BEST_REF_MATCH,N_UCBShift
1,MET,8.328070551076701,,0,0,0,8.328070551076701,4.766079723673549,,0,0,0,4.766079723673549,174.11601955148186,,0,0,0,174.11601955148186,53.30025347688977,,0,0,0,53.30025347688977,32.644019406388054,,0,0,0,32.644019406388054,121.82982116571208,,0,0,0,121.82982116571208
2,PRO,,,0,0,0,,4.360427944943945,,0,0,0,4.360427944943945,176.52158392982574,,0,0,0,176.52158392982574,63.170988329587075,,0,0,0,63.170988329587075,32.0735838980686,,0,0,0,32.0735838980686,,,0,0,0,
3,ALA,8.357406127550227,,0,0,0,8.357406127550227,4.393193324952825,,0,0,0,4.393193324952825,177.4817611542735,,0,0,0,177.4817611542735,52.15859207554112,,0,0,0,52.15859207554112,19.26843425878011,,0,0,0,19.26843425878011,125.6130666962704,,0,0,0,125.6130666962704
4,SER,8.579110315706515,,0,0,0,8.579110315706515,4.625329050549451,,0,0,0,4.625329050549451,174.19802302758353,,0,0,0,174.19802302758353,58.67001958642468,,0,0,0,58.67001958642468,64.53081180977911,,0,0,0,64.53081180977911,115.3099243975691,,0,0,0,115.3099243975691
5,ARG,8.722040231274281,,0,0,0,8.722040231274281,4.704748794855145,,0,0,0,4.704748794855145,174.60896285904096,,0,0,0,174.60896285904096,54.477549825652126,,0,0,0,54.477549825652126,32.98726661474636,,0,0,0,32.98726661474636,122.197999854773,,0,0,0,122.197999854773
6,TYR,8.609957486818736,,0,0,0,8.609957486818736,4.776233643534244,,0,0,0,4.776233643534244,174.78498839475526,,0,0,0,174.78498839475526,57.79312972596848,,0,0,0,57.79312972596848,39.870470534498835,,0,0,0,39.870470534498835,123.14408259361194,,0,0,0,123.14408259361194
7,ILE,8.734969864918416,,0,0,0,8.734969864918416,4.466411722904874,,0,0,0,4.466411722904874,174.05739377893218,,0,0,0,174.05739377893218,59.20490903806749,,0,0,0,59.20490903806749,39.874128368714615,,0,0,0,39.874128368714615,125.790077393118,,0,0,0,125.790077393118
8,THR,8.46171203017538,,0,0,0,8.46171203017538,4.723026397102897,,0,0,0,4.723026397102897,174.2756740076479,,0,0,0,174.2756740076479,61.124345429154175,,0,0,0,61.124345429154175,70.59536234104229,,0,0,0,70.59536234104229,121.62686872914307,,0,0,0,121.62686872914307
9,ASP,8.518366480691531,,0,0,0,8.518366480691531,4.8412447534188034,,0,0,0,4.8412447534188034,176.4857605158508,,0,0,0,176.4857605158508,55.443368274231325,,0,0,0,55.443368274231325,41.80945102727273,,0,0,0,41.80945102727273,125.05160554705296,,0,0,0,125.05160554705296
10,MET,8.336271312659562,,0,0,0,8.336271312659562,4.460604382822733,,0,0,0,4.460604382822733,176.4928413828283,,0,0,0,176.4928413828283,55.06902122219447,,0,0,0,55.06902122219447,33.552682904795205,,0,0,0,33.552682904795205,117.57681252962593,,0,0,0,117.57681252962593
11,THR,8.707190484726386,,0,0,0,8.707190484726386,4.46770988993784,,0,0,0,4.46770988993784,175.7832582387446,,0,0,0,175.7832582387446,61.28523669072039,,0,0,0,61.28523669072039,70.66814794074814,,0,0,0,70.66814794074814,113.51989599129759,,0,0,0,113.51989599129759
12,ILE,8.576968345271395,,0,0,0,8.576968345271395,3.8409805111721615,,0,0,0,3.8409805111721615,177.64309149989455,,0,0,0,177.64309149989455,64.40475527582417,,0,0,0,64.40475527582417,37.289143464935066,,0,0,0,37.289143464935066,121.9706548924742,,0,0,0,121.9706548924742
13,GLU,8.935744295804197,,0,0,0,8.935744295804197,4.1380952295454545,,0,0,0,4.1380952295454545,178.81855682069596,,0,0,0,178.81855682069596,59.893802589815735,,0,0,0,59.893802589815735,28.99558953981574,,0,0,0,28.99558953981574,120.42166170653236,,0,0,0,120.42166170653236
14,GLU,7.997867485775336,,0,0,0,7.997867485775336,4.232044401970252,,0,0,0,4.232044401970252,178.86399615586635,,0,0,0,178.86399615586635,59.279474008846705,,0,0,0,59.279474008846705,30.413300285275835,,0,0,0,30.413300285275835,120.37118446322012,,0,0,0,120.37118446322012
15,LEU,8.37906845938506,,0,0,0,8.37906845938506,4.189551736396937,,0,0,0,4.189551736396937,178.64543145308025,,0,0,0,178.64543145308025,57.499596156543454,,0,0,0,57.499596156543454,42.22195921903652,,0,0,0,42.22195921903652,121.73842141291486,,0,0,0,121.73842141291486
16,SER,7.979070125385726,,0,0,0,7.979070125385726,4.460216882234432,,0,0,0,4.460216882234432,174.96484046882006,,0,0,0,174.96484046882006,59.437266586824286,,0,0,0,59.437266586824286,64.25915476484626,,0,0,0,64.25915476484626,112.49725872857698,,0,0,0,112.49725872857698
17,ARG,7.856947238023088,,0,0,0,7.856947238023088,4.310478261119436,,0,0,0,4.310478261119436,176.55047573594186,,0,0,0,176.55047573594186,56.9714317973693,,0,0,0,56.9714317973693,30.96850861174381,,0,0,0,30.96850861174381,124.06279695752026,,0,0,0,124.06279695752026
18,ASP,8.644158576651126,,0,0,0,8.644158576651126,4.669576751606726,,0,0,0,4.669576751606726,175.54353766549008,,0,0,0,175.54353766549008,54.419379612148965,,0,0,0,54.419379612148965,41.1067509011211,,0,0,0,41.1067509011211,124.62131757007438,,0,0,0,124.62131757007438
19,TRP,8.266271449678099,,0,0,0,8.266271449678099,4.696261407192807,,0,0,0,4.696261407192807,174.51620634817405,,0,0,0,174.51620634817405,56.0390772005106,,0,0,0,56.0390772005106,31.05514209039849,,0,0,0,31.05514209039849,119.626915194672,,0,0,0,119.626915194672
20,PHE,8.755934776079476,,0,0,0,8.755934776079476,4.61990151062826,,0,0,0,4.61990151062826,174.9562962667333,,0,0,0,174.9562962667333,56.89217460610501,,0,0,0,56.89217460610501,41.012052092102344,,0,0,0,41.012052092102344,121.8569074983017,,0,0,0,121.8569074983017
21,MET,6.033069817815517,,0,0,0,6.033069817815517,4.387837720967921,,0,0,0,4.387837720967921,175.36166220448996,,0,0,0,175.36166220448996,54.2829535516317,,0,0,0,54.2829535516317,33.63150776318681,,0,0,0,33.63150776318681,124.52836197099012,,0,0,0,124.52836197099012
22,LEU,10.229787458807857,,0,0,0,10.229787458807857,4.258017067771118,,0,0,0,4.258017067771118,177.55765987056276,,0,0,0,177.55765987056276,56.864681274214675,,0,0,0,56.864681274214675,42.29407463644689,,0,0,0,42.29407463644689,125.94166764442224,,0,0,0,125.94166764442224
23,MET,8.875138973393273,,0,0,0,8.875138973393273,4.980991784715285,,0,0,0,4.980991784715285,173.37703874318458,,0,0,0,173.37703874318458,52.53531259292374,,0,0,0,52.53531259292374,33.448148776212676,,0,0,0,33.448148776212676,118.55801738604728,,0,0,0,118.55801738604728
24,PRO,,,0,0,0,,4.4400475202575205,,0,0,0,4.4400475202575205,175.84813047322123,,0,0,0,175.84813047322123,63.17644584177489,,0,0,0,63.17644584177489,31.93362458171273,,0,0,0,31.93362458171273,,,0,0,0,
25,LYS,8.83897267090687,,0,0,0,8.83897267090687,4.6559738332722835,,0,0,0,4.6559738332722835,174.47564718212897,,0,0,0,174.47564718212897,55.32463107838273,,0,0,0,55.32463107838273,35.49727095160395,,0,0,0,35.49727095160395,124.20344737620714,,0,0,0,124.20344737620714
26,GLN,8.637835363702964,,0,0,0,8.637835363702964,5.287972952830503,,0,0,0,5.287972952830503,174.7300823146076,,0,0,0,174.7300823146076,54.417432751831505,,0,0,0,54.417432751831505,31.874896236141637,,0,0,0,31.874896236141637,125.26050447165612,,0,0,0,125.26050447165612
27,LYS,9.059742303518703,,0,0,0,9.059742303518703,4.668278365107115,,0,0,0,4.668278365107115,174.48107573565323,,0,0,0,174.48107573565323,54.85897262423133,,0,0,0,54.85897262423133,36.09985687557443,,0,0,0,36.09985687557443,125.95241979176934,,0,0,0,125.95241979176934
28,VAL,8.576746746986347,,0,0,0,8.576746746986347,4.536568297907648,,0,0,0,4.536568297907648,175.6750581420635,,0,0,0,175.6750581420635,61.889387402197805,,0,0,0,61.889387402197805,32.3609849513209,,0,0,0,32.3609849513209,124.4741731522089,,0,0,0,124.4741731522089
29,GLU,8.834689411016761,,0,0,0,8.834689411016761,4.47323702086802,,0,0,0,4.47323702086802,176.30592948922742,,0,0,0,176.30592948922742,54.69360768841159,,0,0,0,54.69360768841159,30.911542354933953,,0,0,0,30.911542354933953,128.568844996226,,0,0,0,128.568844996226
30,GLY,8.826282414779666,,0,0,0,8.826282414779666,3.8096883298479303,,0,0,0,3.8096883298479303,173.30965541341436,,0,0,0,173.30965541341436,45.039314583233434,,0,0,0,45.039314583233434,,,0,0,0,,117.0397977532967,,0,0,0,117.0397977532967
31,PRO,,,0,0,0,,3.7695977669941176,,0,0,0,3.7695977669941176,174.54224799990567,,0,0,0,174.54224799990567,63.33596444078144,,0,0,0,63.33596444078144,31.95711598788989,,0,0,0,31.95711598788989,,,0,0,0,
32,LEU,7.63341340995116,,0,0,0,7.63341340995116,4.72834160976246,,0,0,0,4.72834160976246,174.8336378507881,,0,0,0,174.8336378507881,53.72918707696748,,0,0,0,53.72918707696748,44.783183217665666,,0,0,0,44.783183217665666,118.68850206562881,,0,0,0,118.68850206562881
33,CYS,8.964734276701078,,0,0,0,8.964734276701078,4.970607615223665,,0,0,0,4.970607615223665,173.26922589784104,,0,0,0,173.26922589784104,57.423983155439004,,0,0,0,57.423983155439004,29.37404038925519,,0,0,0,29.37404038925519,121.4802515626762,,0,0,0,121.4802515626762
34,ILE,9.259527564441115,,0,0,0,9.259527564441115,5.108353635009435,,0,0,0,5.108353635009435,174.98256004960595,,0,0,0,174.98256004960595,60.22167941073926,,0,0,0,60.22167941073926,40.547831207042954,,0,0,0,40.547831207042954,127.63275585492286,,0,0,0,127.63275585492286
35,ARG,9.204628508485959,,0,0,0,9.204628508485959,5.431411580325229,,0,0,0,5.431411580325229,175.2812671962593,,0,0,0,175.2812671962593,54.59552347609058,,0,0,0,54.59552347609058,33.79971946729937,,0,0,0,33.79971946729937,126.92024895947941,,0,0,0,126.92024895947941
36,ILE,9.219201518176268,,0,0,0,9.219201518176268,5.16456329912865,,0,0,0,5.16456329912865,172.52341574948386,,0,0,0,172.52341574948386,59.68093268952159,,0,0,0,59.68093268952159,42.26209960774781,,0,0,0,42.26209960774781,122.2985813921523,,0,0,0,122.2985813921523
37,ASP,9.081403822571874,,0,0,0,9.081403822571874,4.958520287079587,,0,0,0,4.958520287079587,177.25477894009325,,0,0,0,177.25477894009325,53.087051958491514,,0,0,0,53.087051958491514,41.052666612598514,,0,0,0,41.052666612598514,127.49134619597069,,0,0,0,127.49134619597069
38,GLN,9.067621112049062,,0,0,0,9.067621112049062,4.240662843967144,,0,0,0,4.240662843967144,176.9109736349706,,0,0,0,176.9109736349706,57.575129081252086,,0,0,0,57.575129081252086,28.888319574358974,,0,0,0,28.888319574358974,125.69539086699967,,0,0,0,125.69539086699967
39,ALA,7.839508390642691,,0,0,0,7.839508390642691,4.264186583580309,,0,0,0,4.264186583580309,177.8321444343712,,0,0,0,177.8321444343712,52.7146280056166,,0,0,0,52.7146280056166,19.108618070979023,,0,0,0,19.108618070979023,121.34507151696637,,0,0,0,121.34507151696637
40,ILE,7.280283032634032,,0,0,0,7.280283032634032,4.077399866569541,,0,0,0,4.077399866569541,174.8597435389666,,0,0,0,174.8597435389666,60.259073265856365,,0,0,0,60.259073265856365,36.82230771550117,,0,0,0,36.82230771550117,120.03916437842713,,0,0,0,120.03916437842713
41,MET,7.830111283066932,,0,0,0,7.830111283066932,5.198914559984459,,0,0,0,5.198914559984459,175.544096541786,,0,0,0,175.544096541786,54.32812408597513,,0,0,0,54.32812408597513,34.974762546109446,,0,0,0,34.974762546109446,124.06639026677212,,0,0,0,124.06639026677212
42,ASP,8.622828221678322,,0,0,0,8.622828221678322,4.452764915984016,,0,0,0,4.452764915984016,175.4260218355034,,0,0,0,175.4260218355034,55.19880142384282,,0,0,0,55.19880142384282,39.846483770163175,,0,0,0,39.846483770163175,118.47615349233544,,0,0,0,118.47615349233544
43,LYS,8.17799739100899,,0,0,0,8.17799739100899,4.57992988945499,,0,0,0,4.57992988945499,175.45048585014985,,0,0,0,175.45048585014985,54.765251101221004,,0,0,0,54.765251101221004,34.76762637112332,,0,0,0,34.76762637112332,117.92015535099901,,0,0,0,117.92015535099901
44,ASN,8.568970116539017,,0,0,0,8.568970116539017,5.139274954256855,,0,0,0,5.139274954256855,174.571794678638,,0,0,0,174.571794678638,53.03961362117882,,0,0,0,53.03961362117882,39.03873673199578,,0,0,0,39.03873673199578,120.712463449223,,0,0,0,120.712463449223
45,ILE,8.899880351981352,,0,0,0,8.899880351981352,5.030810515995117,,0,0,0,5.030810515995117,174.4471959428627,,0,0,0,174.4471959428627,58.560862740198694,,0,0,0,58.560862740198694,39.50665536934177,,0,0,0,39.50665536934177,125.28855868194583,,0,0,0,125.28855868194583
46,MET,9.280591646176047,,0,0,0,9.280591646176047,5.241146294932845,,0,0,0,5.241146294932845,175.46450680953492,,0,0,0,175.46450680953492,53.507374837767784,,0,0,0,53.507374837767784,34.38824569106449,,0,0,0,34.38824569106449,126.97134751930291,,0,0,0,126.97134751930291
47,LEU,9.314459997574648,,0,0,0,9.314459997574648,5.133433271517372,,0,0,0,5.133433271517372,175.78029891800975,,0,0,0,175.78029891800975,54.26530242980353,,0,0,0,54.26530242980353,42.579888965234765,,0,0,0,42.579888965234765,128.01147908972695,,0,0,0,128.01147908972695
48,LYS,9.097158256443555,,0,0,0,9.097158256443555,4.932076925702075,,0,0,0,4.932076925702075,174.91559140677654,,0,0,0,174.91559140677654,54.99675980576646,,0,0,0,54.99675980576646,36.354535354306805,,0,0,0,36.354535354306805,121.89113936242092,,0,0,0,121.89113936242092
49,ALA,9.23780820142635,,0,0,0,9.23780820142635,5.558927856338109,,0,0,0,5.558927856338109,175.83494854584305,,0,0,0,175.83494854584305,50.60953897257742,,0,0,0,50.60953897257742,23.485891211494067,,0,0,0,23.485891211494067,123.39540176751582,,0,0,0,123.39540176751582
50,ASN,8.965864314707515,,0,0,0,8.965864314707515,5.740088005749806,,0,0,0,5.740088005749806,174.84071080548895,,0,0,0,174.84071080548895,51.54151934339549,,0,0,0,51.54151934339549,41.262772405649905,,0,0,0,41.262772405649905,118.49154715961261,,0,0,0,118.49154715961261
51,PHE,8.717413591847043,,0,0,0,8.717413591847043,5.28457797052947,,0,0,0,5.28457797052947,172.69323869781886,,0,0,0,172.69323869781886,55.871905302242205,,0,0,0,55.871905302242205,39.99904870509491,,0,0,0,39.99904870509491,119.270625049112,,0,0,0,119.270625049112
52,SER,9.030400320185372,,0,0,0,9.030400320185372,5.171944294433343,,0,0,0,5.171944294433343,174.45074777299368,,0,0,0,174.45074777299368,56.905637252580746,,0,0,0,56.905637252580746,65.58919357514152,,0,0,0,65.58919357514152,116.00205794479965,,0,0,0,116.00205794479965
53,VAL,8.8638085493007,,0,0,0,8.8638085493007,5.214842677555778,,0,0,0,5.214842677555778,174.08086965127652,,0,0,0,174.08086965127652,58.9656536539849,,0,0,0,58.9656536539849,34.910207662071265,,0,0,0,34.910207662071265,118.78399753537573,,0,0,0,118.78399753537573
54,ILE,8.654581977339328,,0,0,0,8.654581977339328,4.536062856304807,,0,0,0,4.536062856304807,176.23175693474303,,0,0,0,176.23175693474303,60.28059331677767,,0,0,0,60.28059331677767,40.885027958080805,,0,0,0,40.885027958080805,125.5015210972805,,0,0,0,125.5015210972805
55,PHE,8.75452758987679,,0,0,0,8.75452758987679,4.1993043068459315,,0,0,0,4.1993043068459315,174.92585276724944,,0,0,0,174.92585276724944,59.193741926856475,,0,0,0,59.193741926856475,37.148422834992786,,0,0,0,37.148422834992786,126.74585460266955,,0,0,0,126.74585460266955
56,ASP,8.557624498595848,,0,0,0,8.557624498595848,4.48062967009657,,0,0,0,4.48062967009657,174.83488521454657,,0,0,0,174.83488521454657,56.04969107409257,,0,0,0,56.04969107409257,40.04440992478078,,0,0,0,40.04440992478078,111.1364974393662,,0,0,0,111.1364974393662
57,ARG,7.957152602258852,,0,0,0,7.957152602258852,5.269628087495837,,0,0,0,5.269628087495837,175.14376989864581,,0,0,0,175.14376989864581,54.30335142554667,,0,0,0,54.30335142554667,33.67392653077478,,0,0,0,33.67392653077478,118.79571736959707,,0,0,0,118.79571736959707
58,LEU,8.751758064169165,,0,0,0,8.751758064169165,4.40057662997558,,0,0,0,4.40057662997558,175.35924137034075,,0,0,0,175.35924137034075,56.64534554996115,,0,0,0,56.64534554996115,42.56810283936619,,0,0,0,42.56810283936619,126.0025751632978,,0,0,0,126.0025751632978
59,GLU,9.051885284521035,,0,0,0,9.051885284521035,4.445139775108225,,0,0,0,4.445139775108225,176.07954932959262,,0,0,0,176.07954932959262,57.25966651103341,,0,0,0,57.25966651103341,31.572755113508713,,0,0,0,31.572755113508713,129.69127362751138,,0,0,0,129.69127362751138
60,THR,7.8719466552392054,,0,0,0,7.8719466552392054,4.578544348357198,,0,0,0,4.578544348357198,173.09345505722055,,0,0,0,173.09345505722055,61.31481591419691,,0,0,0,61.31481591419691,71.29780782736708,,0,0,0,71.29780782736708,113.58420138939948,,0,0,0,113.58420138939948
61,LEU,9.043878482445333,,0,0,0,9.043878482445333,4.422733782695083,,0,0,0,4.422733782695083,175.2158825338217,,0,0,0,175.2158825338217,55.85085675973471,,0,0,0,55.85085675973471,42.55037462454767,,0,0,0,42.55037462454767,129.37420613402153,,0,0,0,129.37420613402153
62,ILE,8.885511234643134,,0,0,0,8.885511234643134,4.201599891744367,,0,0,0,4.201599891744367,175.9152987982684,,0,0,0,175.9152987982684,62.195159754378956,,0,0,0,62.195159754378956,38.30562749388389,,0,0,0,38.30562749388389,126.84621515684871,,0,0,0,126.84621515684871
63,LEU,8.048198128626929,,0,0,0,8.048198128626929,4.830073264213564,,0,0,0,4.830073264213564,174.56134338616383,,0,0,0,174.56134338616383,55.012212204306806,,0,0,0,55.012212204306806,45.952817847491396,,0,0,0,45.952817847491396,118.86313555979577,,0,0,0,118.86313555979577
64,LEU,8.892902135914087,,0,0,0,8.892902135914087,5.315447971656122,,0,0,0,5.315447971656122,174.77153289978355,,0,0,0,174.77153289978355,53.494691373310026,,0,0,0,53.494691373310026,45.911174027172834,,0,0,0,45.911174027172834,127.0135690026862,,0,0,0,127.0135690026862
65,ARG,9.068608474075926,,0,0,0,9.068608474075926,4.849438420879121,,0,0,0,4.849438420879121,174.25907021101676,,0,0,0,174.25907021101676,54.54441998730159,,0,0,0,54.54441998730159,34.77219238386058,,0,0,0,34.77219238386058,125.1364760874792,,0,0,0,125.1364760874792
66,ALA,8.462535082434233,,0,0,0,8.462535082434233,4.963401874586525,,0,0,0,4.963401874586525,175.0299407041625,,0,0,0,175.0299407041625,49.877604755350205,,0,0,0,49.877604755350205,20.68985052917083,,0,0,0,20.68985052917083,124.70932545054944,,0,0,0,124.70932545054944
67,PHE,9.341758562426463,,0,0,0,9.341758562426463,5.34836654058719,,0,0,0,5.34836654058719,175.88297677881008,,0,0,0,175.88297677881008,56.39155657793318,,0,0,0,56.39155657793318,42.397902905128205,,0,0,0,42.397902905128205,122.64140209406705,,0,0,0,122.64140209406705
68,THR,8.964998002963704,,0,0,0,8.964998002963704,5.129443068431568,,0,0,0,5.129443068431568,176.94961796512376,,0,0,0,176.94961796512376,61.43080226028971,,0,0,0,61.43080226028971,71.03014407129537,,0,0,0,71.03014407129537,114.77849553608058,,0,0,0,114.77849553608058
69,GLU,9.000528835891886,,0,0,0,9.000528835891886,4.110824539180264,,0,0,0,4.110824539180264,177.57262783504274,,0,0,0,177.57262783504274,59.05478068444334,,0,0,0,59.05478068444334,29.547598508635808,,0,0,0,29.547598508635808,121.30540023477634,,0,0,0,121.30540023477634
70,GLU,7.931557948179599,,0,0,0,7.931557948179599,4.318297337312687,,0,0,0,4.318297337312687,177.29952071227106,,0,0,0,177.29952071227106,56.07473017849373,,0,0,0,56.07473017849373,29.47770237068487,,0,0,0,29.47770237068487,116.47856801782108,,0,0,0,116.47856801782108
71,GLY,8.091713600038851,,0,0,0,8.091713600038851,4.137182968523144,,0,0,0,4.137182968523144,173.93002862688422,,0,0,0,173.93002862688422,45.483238686169386,,0,0,0,45.483238686169386,,,0,0,0,,108.84626946702187,,0,0,0,108.84626946702187
72,ALA,7.933114578943279,,0,0,0,7.933114578943279,4.480470071517372,,0,0,0,4.480470071517372,176.98265232118993,,0,0,0,176.98265232118993,52.29633019714175,,0,0,0,52.29633019714175,19.435462365240316,,0,0,0,19.435462365240316,123.28799091655566,,0,0,0,123.28799091655566
73,ILE,8.598146112981464,,0,0,0,8.598146112981464,4.280515794844045,,0,0,0,4.280515794844045,176.5968205051615,,0,0,0,176.5968205051615,61.03529530808081,,0,0,0,61.03529530808081,38.02282271469086,,0,0,0,38.02282271469086,120.23995115369075,,0,0,0,120.23995115369075
74,VAL,8.818889593439893,,0,0,0,8.818889593439893,4.524621418498168,,0,0,0,4.524621418498168,174.71689095361307,,0,0,0,174.71689095361307,60.51677273161838,,0,0,0,60.51677273161838,33.90073635521146,,0,0,0,33.90073635521146,118.75181536428572,,0,0,0,118.75181536428572
75,GLY,6.736838033211233,,0,0,0,6.736838033211233,4.075912317185593,,0,0,0,4.075912317185593,170.73724283902763,,0,0,0,170.73724283902763,46.145918805477855,,0,0,0,46.145918805477855,,,0,0,0,,106.18044076746587,,0,0,0,106.18044076746587
76,GLU,9.068791665762015,,0,0,0,9.068791665762015,5.191730851587301,,0,0,0,5.191730851587301,174.74418959802418,,0,0,0,174.74418959802418,55.423425365223665,,0,0,0,55.423425365223665,34.37673609695305,,0,0,0,34.37673609695305,120.82544672387613,,0,0,0,120.82544672387613
77,ILE,9.175173497430348,,0,0,0,9.175173497430348,5.215689475069375,,0,0,0,5.215689475069375,174.8605448965368,,0,0,0,174.8605448965368,60.37692793609169,,0,0,0,60.37692793609169,40.46664681874792,,0,0,0,40.46664681874792,125.03128410614387,,0,0,0,125.03128410614387
78,SER,9.012189835803085,,0,0,0,9.012189835803085,5.260061731740482,,0,0,0,5.260061731740482,172.10097223754022,,0,0,0,172.10097223754022,54.7343264471251,,0,0,0,54.7343264471251,64.75020871635587,,0,0,0,64.75020871635587,121.33309364357308,,0,0,0,121.33309364357308
79,PRO,,,0,0,0,,4.511780182212233,,0,0,0,4.511780182212233,177.2262280626873,,0,0,0,177.2262280626873,63.27610817910978,,0,0,0,63.27610817910978,32.09351062334888,,0,0,0,32.09351062334888,,,0,0,0,
80,LEU,8.6553774002997,,0,0,0,8.6553774002997,4.728322593090243,,0,0,0,4.728322593090243,176.95497531674437,,0,0,0,176.95497531674437,52.3735132992674,,0,0,0,52.3735132992674,41.36427882183928,,0,0,0,41.36427882183928,124.87973776352536,,0,0,0,124.87973776352536
81,PRO,,,0,0,0,,4.438899116178266,,0,0,0,4.438899116178266,177.97993371066713,,0,0,0,177.97993371066713,64.9980275590687,,0,0,0,64.9980275590687,31.662012254329007,,0,0,0,31.662012254329007,,,0,0,0,
82,SER,8.24626327059607,,0,0,0,8.24626327059607,4.40122509060384,,0,0,0,4.40122509060384,174.65463178460428,,0,0,0,174.65463178460428,58.538470518498166,,0,0,0,58.538470518498166,62.78330165292485,,0,0,0,62.78330165292485,111.96989398077478,,0,0,0,111.96989398077478
83,PHE,7.8445866852924855,,0,0,0,7.8445866852924855,4.757456649927851,,0,0,0,4.757456649927851,174.79477181098346,,0,0,0,174.79477181098346,55.920209835092685,,0,0,0,55.920209835092685,39.547323283921635,,0,0,0,39.547323283921635,123.8116851331391,,0,0,0,123.8116851331391
84,PRO,,,0,0,0,,4.502361000086025,,0,0,0,4.502361000086025,176.58911773767343,,0,0,0,176.58911773767343,63.738969802109,,0,0,0,63.738969802109,32.09608146919192,,0,0,0,32.09608146919192,,,0,0,0,
85,GLY,8.166166346503497,,0,0,0,8.166166346503497,4.014659280722055,,0,0,0,4.014659280722055,172.94853382670107,,0,0,0,172.94853382670107,44.96076027595183,,0,0,0,44.96076027595183,,,0,0,0,,108.1503558530636,,0,0,0,108.1503558530636
86,HIS,8.137232608691308,,0,0,0,8.137232608691308,4.664544946164946,,0,0,0,4.664544946164946,173.73738647662336,,0,0,0,173.73738647662336,55.43565935513931,,0,0,0,55.43565935513931,31.586990994350092,,0,0,0,31.586990994350092,115.50640630385726,,0,0,0,115.50640630385726
87,THR,8.635157697735599,,0,0,0,8.635157697735599,4.692752468625819,,0,0,0,4.692752468625819,175.77922377760572,,0,0,0,175.77922377760572,59.92519690895216,,0,0,0,59.92519690895216,71.52795131452436,,0,0,0,71.52795131452436,112.44325495006659,,0,0,0,112.44325495006659
88,ILE,8.715749065651016,,0,0,0,8.715749065651016,3.856750516142191,,0,0,0,3.856750516142191,177.56050884707514,,0,0,0,177.56050884707514,63.96191645786991,,0,0,0,63.96191645786991,38.01632176094461,,0,0,0,38.01632176094461,121.20845976017871,,0,0,0,121.20845976017871
89,GLU,8.244759854179154,,0,0,0,8.244759854179154,3.9553391535742035,,0,0,0,3.9553391535742035,178.79111773023644,,0,0,0,178.79111773023644,59.410105985214784,,0,0,0,59.410105985214784,28.786604646325895,,0,0,0,28.786604646325895,119.55488273894994,,0,0,0,119.55488273894994