RESNUM,RESNAME,H_X,H_Y,H_BEST_REF_SCORE,H_BEST_REF_COV,H_BEST_REF_MATCH,H_UCBShift,HA_X,HA_Y,HA_BEST_REF_SCORE,HA_BEST_REF_COV,HA_BEST_REF_MATCH,HA_UCBShift,C_X,C_Y,C_BEST_REF_SCORE,C_BEST_REF_COV,C_BEST_REF_MATCH,C_UCBShift,CA_X,CA_Y,CA_BEST_REF_SCORE,CA_BEST_REF_COV,CA_BEST_REF_MATCH,CA_UCBShift,CB_X,CB_Y,CB_BEST_REF_SCORE,CB_BEST_REF_COV,CB_BEST_REF_MATCH,CB_UCBShift,N_X,N_Y,N_BEST_REF_SCORE,N_BEST_REF_COV,N_BEST_REF_MATCH,N_UCBShift
1,MET,8.355541095254745,,0,0,0,8.355541095254745,4.404479771747696,,0,0,0,4.404479771747696,174.58109759612054,,0,0,0,174.58109759612054,55.047422384343434,,0,0,0,55.047422384343434,33.190287224841825,,0,0,0,33.190287224841825,120.48363006042845,,0,0,0,120.48363006042845
2,ASP,8.332914831618382,,0,0,0,8.332914831618382,4.667419400530026,,0,0,0,4.667419400530026,176.6117717172106,,0,0,0,176.6117717172106,54.024206642562994,,0,0,0,54.024206642562994,42.078056974880674,,0,0,0,42.078056974880674,122.97176213292263,,0,0,0,122.97176213292263
3,GLN,8.844555436752138,,0,0,0,8.844555436752138,4.0423880814602065,,0,0,0,4.0423880814602065,177.69764755280275,,0,0,0,177.69764755280275,58.541500253524255,,0,0,0,58.541500253524255,28.686280145454546,,0,0,0,28.686280145454546,125.68199256938615,,0,0,0,125.68199256938615
4,PHE,8.223094622827173,,0,0,0,8.223094622827173,3.9676564588966583,,0,0,0,3.9676564588966583,176.9441402987124,,0,0,0,176.9441402987124,60.88964186186036,,0,0,0,60.88964186186036,39.01310197826063,,0,0,0,39.01310197826063,120.62425745726496,,0,0,0,120.62425745726496
5,LEU,8.285416061915862,,0,0,0,8.285416061915862,3.3921517838633592,,0,0,0,3.3921517838633592,178.5872346217338,,0,0,0,178.5872346217338,57.79136863957709,,0,0,0,57.79136863957709,41.17593463215673,,0,0,0,41.17593463215673,119.4603423040404,,0,0,0,119.4603423040404
6,VAL,8.05833365018315,,0,0,0,8.05833365018315,3.471971124672549,,0,0,0,3.471971124672549,177.81543426046733,,0,0,0,177.81543426046733,66.64341201385837,,0,0,0,66.64341201385837,31.54928165016095,,0,0,0,31.54928165016095,118.87189637519148,,0,0,0,118.87189637519148
7,GLN,7.724260032339883,,0,0,0,7.724260032339883,4.161637263131313,,0,0,0,4.161637263131313,178.89949697745033,,0,0,0,178.89949697745033,58.55797426769342,,0,0,0,58.55797426769342,28.297353679098677,,0,0,0,28.297353679098677,118.82399055069375,,0,0,0,118.82399055069375
8,ILE,8.269000387834389,,0,0,0,8.269000387834389,3.7299441636752144,,0,0,0,3.7299441636752144,178.28596253610834,,0,0,0,178.28596253610834,64.45100893101343,,0,0,0,64.45100893101343,35.83858656905317,,0,0,0,35.83858656905317,120.99232331517926,,0,0,0,120.99232331517926
9,PHE,8.82419351939172,,0,0,0,8.82419351939172,4.430107629237429,,0,0,0,4.430107629237429,178.27375915288047,,0,0,0,178.27375915288047,58.77209487896548,,0,0,0,58.77209487896548,36.400942000921304,,0,0,0,36.400942000921304,119.40004828408257,,0,0,0,119.40004828408257
10,ALA,8.169510963697414,,0,0,0,8.169510963697414,4.17749167533855,,0,0,0,4.17749167533855,180.74678376673882,,0,0,0,180.74678376673882,55.200439754195806,,0,0,0,55.200439754195806,18.058454670579422,,0,0,0,18.058454670579422,122.76565605700965,,0,0,0,122.76565605700965
11,VAL,8.14111185916306,,0,0,0,8.14111185916306,3.6756902117410366,,0,0,0,3.6756902117410366,178.40496990902986,,0,0,0,178.40496990902986,66.95195507346541,,0,0,0,66.95195507346541,31.630926716539015,,0,0,0,31.630926716539015,118.88247423132978,,0,0,0,118.88247423132978
12,ILE,8.49307646033966,,0,0,0,8.49307646033966,3.4807785777999793,,0,0,0,3.4807785777999793,178.3570332264902,,0,0,0,178.3570332264902,65.85169113866688,,0,0,0,65.85169113866688,37.64666250974026,,0,0,0,37.64666250974026,120.79811276565103,,0,0,0,120.79811276565103
13,HIS,8.359339174952824,,0,0,0,8.359339174952824,4.28150626945832,,0,0,0,4.28150626945832,176.62328616280385,,0,0,0,176.62328616280385,58.912422289588186,,0,0,0,58.912422289588186,29.512797700105452,,0,0,0,29.512797700105452,117.06917532727273,,0,0,0,117.06917532727273
14,GLN,7.487191953996005,,0,0,0,7.487191953996005,4.228319075574426,,0,0,0,4.228319075574426,175.76800701880896,,0,0,0,175.76800701880896,56.12037629686425,,0,0,0,56.12037629686425,29.835017826240424,,0,0,0,29.835017826240424,116.88507456370851,,0,0,0,116.88507456370851
15,ILE,7.153879984260184,,0,0,0,7.153879984260184,3.144009937734487,,0,0,0,3.144009937734487,174.3569696425852,,0,0,0,174.3569696425852,59.72803526352536,,0,0,0,59.72803526352536,38.07660402329338,,0,0,0,38.07660402329338,122.2108303417305,,0,0,0,122.2108303417305
16,PRO,,,0,0,0,,4.325675216561217,,0,0,0,4.325675216561217,175.64172362605728,,0,0,0,175.64172362605728,62.30708583114108,,0,0,0,62.30708583114108,32.24639834765235,,0,0,0,32.24639834765235,,,0,0,0,
17,LYS,8.34299607032412,,0,0,0,8.34299607032412,3.7034049403013656,,0,0,0,3.7034049403013656,178.12836927997557,,0,0,0,178.12836927997557,57.94393865053835,,0,0,0,57.94393865053835,32.410942076462426,,0,0,0,32.410942076462426,120.96375135298035,,0,0,0,120.96375135298035
18,GLY,9.011787191469642,,0,0,0,9.011787191469642,3.9602632492396492,,0,0,0,3.9602632492396492,173.15260990665445,,0,0,0,173.15260990665445,45.83266141800977,,0,0,0,45.83266141800977,,,0,0,0,,113.93863743892774,,0,0,0,113.93863743892774
19,LYS,7.76350651052281,,0,0,0,7.76350651052281,5.300211639072038,,0,0,0,5.300211639072038,175.14711717137862,,0,0,0,175.14711717137862,53.68602779036519,,0,0,0,53.68602779036519,35.44414432817183,,0,0,0,35.44414432817183,119.19871420596071,,0,0,0,119.19871420596071
20,VAL,8.974650069092018,,0,0,0,8.974650069092018,5.0621427533966035,,0,0,0,5.0621427533966035,174.4897843925297,,0,0,0,174.4897843925297,59.159753024797425,,0,0,0,59.159753024797425,35.497526535908534,,0,0,0,35.497526535908534,113.31351938392163,,0,0,0,113.31351938392163
21,SER,8.85532160891886,,0,0,0,8.85532160891886,5.066452171656122,,0,0,0,5.066452171656122,173.62465465563324,,0,0,0,173.62465465563324,56.48594995863026,,0,0,0,56.48594995863026,65.93511547353758,,0,0,0,65.93511547353758,117.21778896144411,,0,0,0,117.21778896144411
22,THR,8.596614022322123,,0,0,0,8.596614022322123,5.383157677106227,,0,0,0,5.383157677106227,176.51345341360306,,0,0,0,176.51345341360306,59.943947577206124,,0,0,0,59.943947577206124,70.79476475623265,,0,0,0,70.79476475623265,114.69009429006549,,0,0,0,114.69009429006549
23,TYR,8.825941174586523,,0,0,0,8.825941174586523,4.297550084637585,,0,0,0,4.297550084637585,178.1835655607781,,0,0,0,178.1835655607781,62.12106813958263,,0,0,0,62.12106813958263,37.14442401590631,,0,0,0,37.14442401590631,122.40650491623376,,0,0,0,122.40650491623376
24,GLY,8.875690938555888,,0,0,0,8.875690938555888,3.8774881810661572,,0,0,0,3.8774881810661572,176.39554242220004,,0,0,0,176.39554242220004,47.09775267884338,,0,0,0,47.09775267884338,,,0,0,0,,106.53721496272615,,0,0,0,106.53721496272615
25,GLU,7.979617981340881,,0,0,0,7.979617981340881,4.13599604502442,,0,0,0,4.13599604502442,178.8464054235209,,0,0,0,178.8464054235209,59.08845552261627,,0,0,0,59.08845552261627,30.196121261832612,,0,0,0,30.196121261832612,121.8874659997225,,0,0,0,121.8874659997225
26,ILE,8.7898900498557,,0,0,0,8.7898900498557,3.8835201048423804,,0,0,0,3.8835201048423804,178.14627027579644,,0,0,0,178.14627027579644,64.2697826519647,,0,0,0,64.2697826519647,36.154264789099784,,0,0,0,36.154264789099784,121.1103040059274,,0,0,0,121.1103040059274
27,ALA,8.605279893545344,,0,0,0,8.605279893545344,3.9020353333999336,,0,0,0,3.9020353333999336,179.2085519818293,,0,0,0,179.2085519818293,55.57026990909645,,0,0,0,55.57026990909645,18.894566926412477,,0,0,0,18.894566926412477,121.71590779600399,,0,0,0,121.71590779600399
28,LYS,8.171754954151403,,0,0,0,8.171754954151403,4.037849537090687,,0,0,0,4.037849537090687,179.44662014061493,,0,0,0,179.44662014061493,59.66577058121323,,0,0,0,59.66577058121323,32.285781883028086,,0,0,0,32.285781883028086,119.51918491330336,,0,0,0,119.51918491330336
29,MET,8.407757787296037,,0,0,0,8.407757787296037,4.126219248407148,,0,0,0,4.126219248407148,177.73017669216895,,0,0,0,177.73017669216895,58.13839062142857,,0,0,0,58.13839062142857,32.980848303696305,,0,0,0,32.980848303696305,119.90051687791652,,0,0,0,119.90051687791652
30,ALA,8.060532922866024,,0,0,0,8.060532922866024,4.411143364291265,,0,0,0,4.411143364291265,176.7532738420524,,0,0,0,176.7532738420524,52.198864209934506,,0,0,0,52.198864209934506,19.188012666172718,,0,0,0,19.188012666172718,119.05620546697746,,0,0,0,119.05620546697746
31,GLY,7.746846819003219,,0,0,0,7.746846819003219,3.69537529946165,,0,0,0,3.69537529946165,174.51983391348097,,0,0,0,174.51983391348097,45.32471612758353,,0,0,0,45.32471612758353,,,0,0,0,,104.38079057801642,,0,0,0,104.38079057801642
32,TYR,7.908779964840715,,0,0,0,7.908779964840715,4.561102589801864,,0,0,0,4.561102589801864,174.08285651406928,,0,0,0,174.08285651406928,55.6260887525752,,0,0,0,55.6260887525752,38.78725419470529,,0,0,0,38.78725419470529,120.78984692572982,,0,0,0,120.78984692572982
33,PRO,,,0,0,0,,4.4247719615717624,,0,0,0,4.4247719615717624,178.63764952107894,,0,0,0,178.63764952107894,64.01237335942946,,0,0,0,64.01237335942946,31.481214804734154,,0,0,0,31.481214804734154,,,0,0,0,
34,GLY,8.921976064796315,,0,0,0,8.921976064796315,4.038109231077256,,0,0,0,4.038109231077256,175.40509745191477,,0,0,0,175.40509745191477,45.6706829993673,,0,0,0,45.6706829993673,,,0,0,0,,111.67420738199023,,0,0,0,111.67420738199023
35,TYR,8.259664626157175,,0,0,0,8.259664626157175,4.642911521989122,,0,0,0,4.642911521989122,176.43782165697635,,0,0,0,176.43782165697635,57.87739362907093,,0,0,0,57.87739362907093,38.29211314469974,,0,0,0,38.29211314469974,119.39785572642913,,0,0,0,119.39785572642913
36,ALA,8.386163758558109,,0,0,0,8.386163758558109,4.158407221747697,,0,0,0,4.158407221747697,179.02375788657454,,0,0,0,179.02375788657454,56.16006425102675,,0,0,0,56.16006425102675,18.65034436772672,,0,0,0,18.65034436772672,124.18113758492618,,0,0,0,124.18113758492618
37,ARG,8.367073206987458,,0,0,0,8.367073206987458,3.9647765702658457,,0,0,0,3.9647765702658457,178.4794932481352,,0,0,0,178.4794932481352,59.127531141386385,,0,0,0,59.127531141386385,29.85998458058053,,0,0,0,29.85998458058053,117.52645815705961,,0,0,0,117.52645815705961
38,HIS,7.964249494461094,,0,0,0,7.964249494461094,4.382823485003884,,0,0,0,4.382823485003884,177.5089793778999,,0,0,0,177.5089793778999,59.374942411704964,,0,0,0,59.374942411704964,30.014610724791876,,0,0,0,30.014610724791876,119.01642092762238,,0,0,0,119.01642092762238
39,VAL,8.663117429842378,,0,0,0,8.663117429842378,3.8284744553391055,,0,0,0,3.8284744553391055,177.62577916059496,,0,0,0,177.62577916059496,67.0570760031302,,0,0,0,67.0570760031302,31.51248649936175,,0,0,0,31.51248649936175,121.10048702713954,,0,0,0,121.10048702713954
40,GLY,8.380846937534688,,0,0,0,8.380846937534688,3.538574847488622,,0,0,0,3.538574847488622,176.2962012547952,,0,0,0,176.2962012547952,47.29492262927073,,0,0,0,47.29492262927073,,,0,0,0,,107.57959280999,,0,0,0,107.57959280999
41,LYS,8.037809845709845,,0,0,0,8.037809845709845,4.110048020407371,,0,0,0,4.110048020407371,178.94707430333554,,0,0,0,178.94707430333554,59.23479931743256,,0,0,0,59.23479931743256,32.4030327449051,,0,0,0,32.4030327449051,121.32276526227106,,0,0,0,121.32276526227106
42,ALA,8.109404627822178,,0,0,0,8.109404627822178,4.224118983755134,,0,0,0,4.224118983755134,180.006038590565,,0,0,0,180.006038590565,54.91291715213675,,0,0,0,54.91291715213675,18.76004804114219,,0,0,0,18.76004804114219,122.64376985861361,,0,0,0,122.64376985861361
43,LEU,8.51911251096126,,0,0,0,8.51911251096126,4.102031937160063,,0,0,0,4.102031937160063,179.20239600863025,,0,0,0,179.20239600863025,57.01706620960151,,0,0,0,57.01706620960151,41.94363879554889,,0,0,0,41.94363879554889,117.72401031919748,,0,0,0,117.72401031919748
44,GLY,8.268874887495837,,0,0,0,8.268874887495837,3.890261176981352,,0,0,0,3.890261176981352,175.53996032163948,,0,0,0,175.53996032163948,46.12145997206682,,0,0,0,46.12145997206682,,,0,0,0,,107.06684184959485,,0,0,0,107.06684184959485
45,ASN,7.5886184795815295,,0,0,0,7.5886184795815295,4.77821463998779,,0,0,0,4.77821463998779,175.36022973660226,,0,0,0,175.36022973660226,53.02625133816184,,0,0,0,53.02625133816184,39.299696583222335,,0,0,0,39.299696583222335,117.1814326989233,,0,0,0,117.1814326989233
46,LEU,7.17125293890554,,0,0,0,7.17125293890554,4.539598472358197,,0,0,0,4.539598472358197,175.53789704815185,,0,0,0,175.53789704815185,52.983341243850596,,0,0,0,52.983341243850596,41.206621969530474,,0,0,0,41.206621969530474,122.8180875574148,,0,0,0,122.8180875574148
47,PRO,,,0,0,0,,4.502115182833833,,0,0,0,4.502115182833833,176.81841969861804,,0,0,0,176.81841969861804,62.444155957797754,,0,0,0,62.444155957797754,32.28169408426574,,0,0,0,32.28169408426574,,,0,0,0,
48,GLU,8.534820857392607,,0,0,0,8.534820857392607,4.058097717829392,,0,0,0,4.058097717829392,177.5879178182595,,0,0,0,177.5879178182595,57.959125791891445,,0,0,0,57.959125791891445,29.51484049174159,,0,0,0,29.51484049174159,121.00862083484293,,0,0,0,121.00862083484293
49,GLY,8.820090544377845,,0,0,0,8.820090544377845,3.9369857150183147,,0,0,0,3.9369857150183147,174.44925754410033,,0,0,0,174.44925754410033,45.37003557115662,,0,0,0,45.37003557115662,,,0,0,0,,112.04877592892107,,0,0,0,112.04877592892107
50,SER,7.7491974285658785,,0,0,0,7.7491974285658785,4.461608650555,,0,0,0,4.461608650555,175.849428284571,,0,0,0,175.849428284571,58.16340551534576,,0,0,0,58.16340551534576,63.93656355974026,,0,0,0,63.93656355974026,114.78779713433234,,0,0,0,114.78779713433234
51,LYS,8.51434848071928,,0,0,0,8.51434848071928,4.329244149372849,,0,0,0,4.329244149372849,176.88058519425573,,0,0,0,176.88058519425573,56.661550880697085,,0,0,0,56.661550880697085,32.609464752769455,,0,0,0,32.609464752769455,124.6107546414419,,0,0,0,124.6107546414419
52,LEU,8.026215131623932,,0,0,0,8.026215131623932,4.187259625468975,,0,0,0,4.187259625468975,176.16946407131755,,0,0,0,176.16946407131755,52.97715455526696,,0,0,0,52.97715455526696,42.46008117009102,,0,0,0,42.46008117009102,123.98816885979575,,0,0,0,123.98816885979575
53,PRO,,,0,0,0,,4.036355898748473,,0,0,0,4.036355898748473,176.7898040965479,,0,0,0,176.7898040965479,62.39760678547008,,0,0,0,62.39760678547008,29.756538958430458,,0,0,0,29.756538958430458,,,0,0,0,
54,TRP,8.778681002070153,,0,0,0,8.778681002070153,4.278027334171384,,0,0,0,4.278027334171384,177.2173888625208,,0,0,0,177.2173888625208,60.35838000239205,,0,0,0,60.35838000239205,28.174068568664673,,0,0,0,28.174068568664673,121.51678202819957,,0,0,0,121.51678202819957
55,PHE,6.3475391826340335,,0,0,0,6.3475391826340335,3.8977196764679762,,0,0,0,3.8977196764679762,175.97745609603174,,0,0,0,175.97745609603174,58.87837022803863,,0,0,0,58.87837022803863,36.989975366039516,,0,0,0,36.989975366039516,114.28504752258851,,0,0,0,114.28504752258851
56,ARG,7.513614654229104,,0,0,0,7.513614654229104,4.066653128643578,,0,0,0,4.066653128643578,173.67087551486847,,0,0,0,173.67087551486847,57.11936719552114,,0,0,0,57.11936719552114,31.096448954451105,,0,0,0,31.096448954451105,118.28377588389944,,0,0,0,118.28377588389944
57,VAL,7.494049461788212,,0,0,0,7.494049461788212,4.8142864402763905,,0,0,0,4.8142864402763905,175.0746522953491,,0,0,0,175.0746522953491,61.659136126368075,,0,0,0,61.659136126368075,31.980324224758572,,0,0,0,31.980324224758572,120.02885249215784,,0,0,0,120.02885249215784
58,ILE,9.045802880441782,,0,0,0,9.045802880441782,4.679557490670441,,0,0,0,4.679557490670441,174.3606600567599,,0,0,0,174.3606600567599,59.10270788540903,,0,0,0,59.10270788540903,41.88390328049728,,0,0,0,41.88390328049728,120.541419190898,,0,0,0,120.541419190898
59,ASN,8.795610346148298,,0,0,0,8.795610346148298,4.925393790320791,,0,0,0,4.925393790320791,177.41637808944387,,0,0,0,177.41637808944387,51.67643811107226,,0,0,0,51.67643811107226,38.976198773415476,,0,0,0,38.976198773415476,117.96894397675104,,0,0,0,117.96894397675104
60,SER,8.663359074159175,,0,0,0,8.663359074159175,4.297010759645909,,0,0,0,4.297010759645909,175.5151725578588,,0,0,0,175.5151725578588,60.93898346558996,,0,0,0,60.93898346558996,62.97650730806416,,0,0,0,62.97650730806416,114.14494953822845,,0,0,0,114.14494953822845
61,GLN,7.991337987789988,,0,0,0,7.991337987789988,4.45084603003663,,0,0,0,4.45084603003663,176.70934457960928,,0,0,0,176.70934457960928,55.27865963478744,,0,0,0,55.27865963478744,29.008043977611276,,0,0,0,29.008043977611276,119.1212947112554,,0,0,0,119.1212947112554
62,GLY,8.440363158019759,,0,0,0,8.440363158019759,3.922494472644023,,0,0,0,3.922494472644023,173.0750969567266,,0,0,0,173.0750969567266,46.538826204983906,,0,0,0,46.538826204983906,,,0,0,0,,109.18179195223665,,0,0,0,109.18179195223665
63,LYS,8.285320064230213,,0,0,0,8.285320064230213,5.071306960334111,,0,0,0,5.071306960334111,176.3821207015429,,0,0,0,176.3821207015429,54.54051233864469,,0,0,0,54.54051233864469,35.63514188739039,,0,0,0,35.63514188739039,120.20358671337551,,0,0,0,120.20358671337551
64,ILE,8.823957754556554,,0,0,0,8.823957754556554,4.024106707914308,,0,0,0,4.024106707914308,176.50246981361417,,0,0,0,176.50246981361417,63.04572029027639,,0,0,0,63.04572029027639,37.77630241766567,,0,0,0,37.77630241766567,125.49141756384728,,0,0,0,125.49141756384728
65,SER,8.724688394599845,,0,0,0,8.724688394599845,4.529139231562882,,0,0,0,4.529139231562882,174.8657905056499,,0,0,0,174.8657905056499,59.040705564357864,,0,0,0,59.040705564357864,64.20587244039294,,0,0,0,64.20587244039294,121.59568078545344,,0,0,0,121.59568078545344
66,LEU,7.709026822405372,,0,0,0,7.709026822405372,4.411651785661561,,0,0,0,4.411651785661561,175.51453154299588,,0,0,0,175.51453154299588,55.16326238246199,,0,0,0,55.16326238246199,42.72322118283383,,0,0,0,42.72322118283383,122.91620171244865,,0,0,0,122.91620171244865
67,LYS,8.117879925968476,,0,0,0,8.117879925968476,4.4400281012487515,,0,0,0,4.4400281012487515,177.08892934401155,,0,0,0,177.08892934401155,55.5605552455933,,0,0,0,55.5605552455933,34.24110627004107,,0,0,0,34.24110627004107,119.5194836444611,,0,0,0,119.5194836444611
68,GLY,8.693613746420247,,0,0,0,8.693613746420247,4.035813391810967,,0,0,0,4.035813391810967,175.63267641976913,,0,0,0,175.63267641976913,46.65245434271839,,0,0,0,46.65245434271839,,,0,0,0,,110.24983613901098,,0,0,0,110.24983613901098
69,ARG,8.599294518981019,,0,0,0,8.599294518981019,4.112915735836386,,0,0,0,4.112915735836386,177.8636816781552,,0,0,0,177.8636816781552,58.098814611854806,,0,0,0,58.098814611854806,30.23064666881452,,0,0,0,30.23064666881452,123.11661401863137,,0,0,0,123.11661401863137
70,ASP,8.238665428527028,,0,0,0,8.238665428527028,4.575894988250639,,0,0,0,4.575894988250639,178.4034884303197,,0,0,0,178.4034884303197,56.76202178736264,,0,0,0,56.76202178736264,41.49342286101121,,0,0,0,41.49342286101121,119.83249932500279,,0,0,0,119.83249932500279
71,LEU,8.056791914319014,,0,0,0,8.056791914319014,4.143216137418138,,0,0,0,4.143216137418138,178.6298199541181,,0,0,0,178.6298199541181,58.0062398990121,,0,0,0,58.0062398990121,41.660883495543345,,0,0,0,41.660883495543345,121.61881642114552,,0,0,0,121.61881642114552
72,ASP,8.222287437101787,,0,0,0,8.222287437101787,4.406098772677322,,0,0,0,4.406098772677322,178.46394770181487,,0,0,0,178.46394770181487,57.687528981679435,,0,0,0,57.687528981679435,40.907993892285496,,0,0,0,40.907993892285496,120.26646759968921,,0,0,0,120.26646759968921
73,ARG,8.08475196001776,,0,0,0,8.08475196001776,4.095825951015651,,0,0,0,4.095825951015651,178.96086294149185,,0,0,0,178.96086294149185,59.762685528438226,,0,0,0,59.762685528438226,30.184195887667887,,0,0,0,30.184195887667887,120.4175652057942,,0,0,0,120.4175652057942
74,GLN,8.523876187001887,,0,0,0,8.523876187001887,3.8450760711788217,,0,0,0,3.8450760711788217,177.62902788220669,,0,0,0,177.62902788220669,59.09529766491287,,0,0,0,59.09529766491287,28.772275378399378,,0,0,0,28.772275378399378,119.86372582810523,,0,0,0,119.86372582810523
75,LYS,8.580044855500054,,0,0,0,8.580044855500054,3.643874672152847,,0,0,0,3.643874672152847,178.17808674189143,,0,0,0,178.17808674189143,60.50272040721501,,0,0,0,60.50272040721501,32.170357417227216,,0,0,0,32.170357417227216,120.59466662312688,,0,0,0,120.59466662312688
76,GLN,8.391282446675547,,0,0,0,8.391282446675547,3.91406120454268,,0,0,0,3.91406120454268,178.59218906699968,,0,0,0,178.59218906699968,58.95325988623599,,0,0,0,58.95325988623599,28.48974866930847,,0,0,0,28.48974866930847,117.26302109818515,,0,0,0,117.26302109818515
77,LYS,7.639400519336219,,0,0,0,7.639400519336219,3.8029773209956708,,0,0,0,3.8029773209956708,179.0347197437618,,0,0,0,179.0347197437618,59.10739346505717,,0,0,0,59.10739346505717,31.489642316677767,,0,0,0,31.489642316677767,119.59163383889444,,0,0,0,119.59163383889444
78,LEU,8.194373231773781,,0,0,0,8.194373231773781,4.012397208008658,,0,0,0,4.012397208008658,179.21857707887668,,0,0,0,179.21857707887668,58.064492076018425,,0,0,0,58.064492076018425,41.89542445374625,,0,0,0,41.89542445374625,120.21268242323232,,0,0,0,120.21268242323232
79,GLU,8.672826352364302,,0,0,0,8.672826352364302,4.027685070165945,,0,0,0,4.027685070165945,180.76548968746252,,0,0,0,180.76548968746252,59.43827003724609,,0,0,0,59.43827003724609,29.59518621196026,,0,0,0,29.59518621196026,120.91262294602619,,0,0,0,120.91262294602619
80,ALA,7.938902232317683,,0,0,0,7.938902232317683,4.132522333877234,,0,0,0,4.132522333877234,178.6790580914419,,0,0,0,178.6790580914419,54.311440787296036,,0,0,0,54.311440787296036,18.298332416217118,,0,0,0,18.298332416217118,121.5761358578921,,0,0,0,121.5761358578921
81,GLU,7.5989277636752135,,0,0,0,7.5989277636752135,4.339954233566433,,0,0,0,4.339954233566433,176.66065622422576,,0,0,0,176.66065622422576,55.83658922461983,,0,0,0,55.83658922461983,29.948318349966698,,0,0,0,29.948318349966698,114.91959476396937,,0,0,0,114.91959476396937
82,GLY,7.7217323221778225,,0,0,0,7.7217323221778225,3.989422287839938,,0,0,0,3.989422287839938,174.74406861137197,,0,0,0,174.74406861137197,45.750663374991674,,0,0,0,45.750663374991674,,,0,0,0,,107.69464870411255,,0,0,0,107.69464870411255
83,ILE,7.7107197798090805,,0,0,0,7.7107197798090805,3.3417132663059164,,0,0,0,3.3417132663059164,174.74828952321567,,0,0,0,174.74828952321567,60.64927435225885,,0,0,0,60.64927435225885,37.6795625472694,,0,0,0,37.6795625472694,121.89899515860806,,0,0,0,121.89899515860806
84,GLU,7.925446834659784,,0,0,0,7.925446834659784,4.314700283064158,,0,0,0,4.314700283064158,175.4822657018315,,0,0,0,175.4822657018315,56.53271546835942,,0,0,0,56.53271546835942,30.161123853035853,,0,0,0,30.161123853035853,128.16756067903762,,0,0,0,128.16756067903762
85,VAL,8.30992914100344,,0,0,0,8.30992914100344,4.609597951104451,,0,0,0,4.609597951104451,175.85813743958266,,0,0,0,175.85813743958266,61.28245178845599,,0,0,0,61.28245178845599,33.44132730570541,,0,0,0,33.44132730570541,124.70854349322344,,0,0,0,124.70854349322344
86,SER,8.91114578947719,,0,0,0,8.91114578947719,4.478186169125319,,0,0,0,4.478186169125319,176.14275351218225,,0,0,0,176.14275351218225,58.07877452565212,,0,0,0,58.07877452565212,64.61374334072593,,0,0,0,64.61374334072593,123.26585827450883,,0,0,0,123.26585827450883
87,GLU,9.063254596203796,,0,0,0,9.063254596203796,4.0499017076784325,,0,0,0,4.0499017076784325,177.30546249995004,,0,0,0,177.30546249995004,58.97348417003552,,0,0,0,58.97348417003552,29.3818254528305,,0,0,0,29.3818254528305,121.13500418244533,,0,0,0,121.13500418244533
88,ILE,7.76287915962926,,0,0,0,7.76287915962926,4.327816035980686,,0,0,0,4.327816035980686,176.55732259084803,,0,0,0,176.55732259084803,60.882857196975245,,0,0,0,60.882857196975245,37.82209117415917,,0,0,0,37.82209117415917,110.94291707767789,,0,0,0,110.94291707767789
89,GLY,8.245110404423354,,0,0,0,8.245110404423354,4.019815879717505,,0,0,0,4.019815879717505,173.59101878779,,0,0,0,173.59101878779,46.10680212120657,,0,0,0,46.10680212120657,,,0,0,0,,109.55727333580309,,0,0,0,109.55727333580309
90,LYS,8.183968603268953,,0,0,0,8.183968603268953,4.465216216527916,,0,0,0,4.465216216527916,176.0129853434954,,0,0,0,176.0129853434954,56.00745700190365,,0,0,0,56.00745700190365,33.047010314513265,,0,0,0,33.047010314513265,121.8965448923521,,0,0,0,121.8965448923521