RESNUM,RESNAME,H_X,H_Y,H_BEST_REF_SCORE,H_BEST_REF_COV,H_BEST_REF_MATCH,H_UCBShift,HA_X,HA_Y,HA_BEST_REF_SCORE,HA_BEST_REF_COV,HA_BEST_REF_MATCH,HA_UCBShift,C_X,C_Y,C_BEST_REF_SCORE,C_BEST_REF_COV,C_BEST_REF_MATCH,C_UCBShift,CA_X,CA_Y,CA_BEST_REF_SCORE,CA_BEST_REF_COV,CA_BEST_REF_MATCH,CA_UCBShift,CB_X,CB_Y,CB_BEST_REF_SCORE,CB_BEST_REF_COV,CB_BEST_REF_MATCH,CB_UCBShift,N_X,N_Y,N_BEST_REF_SCORE,N_BEST_REF_COV,N_BEST_REF_MATCH,N_UCBShift
1,MET,8.365686752702851,,0,0,0,8.365686752702851,4.394317506252081,,0,0,0,4.394317506252081,175.57062360029417,,0,0,0,175.57062360029417,55.224835541247636,,0,0,0,55.224835541247636,33.03781979673104,,0,0,0,33.03781979673104,120.73172111176045,,0,0,0,120.73172111176045
2,ASP,8.390161104190254,,0,0,0,8.390161104190254,4.6107544318681315,,0,0,0,4.6107544318681315,175.49810349104786,,0,0,0,175.49810349104786,54.41383669786325,,0,0,0,54.41383669786325,40.873889523742925,,0,0,0,40.873889523742925,124.06922690218116,,0,0,0,124.06922690218116
3,VAL,7.783047035081585,,0,0,0,7.783047035081585,4.155064345909645,,0,0,0,4.155064345909645,175.00173126609502,,0,0,0,175.00173126609502,61.92534120740926,,0,0,0,61.92534120740926,33.50207891917527,,0,0,0,33.50207891917527,119.9111443054612,,0,0,0,119.9111443054612
4,GLU,8.802704833100233,,0,0,0,8.802704833100233,4.67110507025197,,0,0,0,4.67110507025197,174.2534773273005,,0,0,0,174.2534773273005,53.11954592634588,,0,0,0,53.11954592634588,30.49360034015984,,0,0,0,30.49360034015984,128.94023177605172,,0,0,0,128.94023177605172
5,PRO,,,0,0,0,,4.007461019222445,,0,0,0,4.007461019222445,178.02480471262072,,0,0,0,178.02480471262072,63.816188688772336,,0,0,0,63.816188688772336,31.633663223443225,,0,0,0,31.633663223443225,,,0,0,0,
6,GLY,9.011351514746364,,0,0,0,9.011351514746364,3.886181440856366,,0,0,0,3.886181440856366,174.5899234406538,,0,0,0,174.5899234406538,45.34689324764125,,0,0,0,45.34689324764125,,,0,0,0,,112.19778483514818,,0,0,0,112.19778483514818
7,LYS,7.743192315345764,,0,0,0,7.743192315345764,4.326215556282606,,0,0,0,4.326215556282606,175.0554393185703,,0,0,0,175.0554393185703,55.82799601019536,,0,0,0,55.82799601019536,33.682203141147745,,0,0,0,33.682203141147745,120.69422263365524,,0,0,0,120.69422263365524
8,PHE,8.501512667626818,,0,0,0,8.501512667626818,5.265725159457209,,0,0,0,5.265725159457209,175.81145671546233,,0,0,0,175.81145671546233,56.66120170589966,,0,0,0,56.66120170589966,41.35064729990565,,0,0,0,41.35064729990565,119.54187247180042,,0,0,0,119.54187247180042
9,TYR,9.363935508441559,,0,0,0,9.363935508441559,4.869741066372517,,0,0,0,4.869741066372517,174.974044650222,,0,0,0,174.974044650222,57.163230956460204,,0,0,0,57.163230956460204,42.676528053035845,,0,0,0,42.676528053035845,120.33905539124208,,0,0,0,120.33905539124208
10,LYS,8.804971602969253,,0,0,0,8.804971602969253,4.689621559107559,,0,0,0,4.689621559107559,175.91639907763903,,0,0,0,175.91639907763903,56.3350352468143,,0,0,0,56.3350352468143,33.1933214934954,,0,0,0,33.1933214934954,124.87892147832169,,0,0,0,124.87892147832169
11,GLY,9.037722564335665,,0,0,0,9.037722564335665,4.07596537482795,,0,0,0,4.07596537482795,171.0276677403874,,0,0,0,171.0276677403874,44.856943134976135,,0,0,0,44.856943134976135,,,0,0,0,,112.99315020551116,,0,0,0,112.99315020551116
12,VAL,8.835984341475191,,0,0,0,8.835984341475191,4.9394347140248644,,0,0,0,4.9394347140248644,175.64100198001998,,0,0,0,175.64100198001998,60.42279353441004,,0,0,0,60.42279353441004,33.706485901487405,,0,0,0,33.706485901487405,120.46520582740592,,0,0,0,120.46520582740592
13,VAL,9.302235017671217,,0,0,0,9.302235017671217,4.356782638769563,,0,0,0,4.356782638769563,177.02031665840826,,0,0,0,177.02031665840826,63.78518883222888,,0,0,0,63.78518883222888,31.578184133494283,,0,0,0,31.578184133494283,128.1625236894439,,0,0,0,128.1625236894439
14,THR,8.891888045909646,,0,0,0,8.891888045909646,4.520416587112887,,0,0,0,4.520416587112887,174.74557708937172,,0,0,0,174.74557708937172,62.08598248827283,,0,0,0,62.08598248827283,69.20595006006216,,0,0,0,69.20595006006216,122.14384452647907,,0,0,0,122.14384452647907
15,ARG,7.6947954451548455,,0,0,0,7.6947954451548455,4.574803182167832,,0,0,0,4.574803182167832,173.7311567245588,,0,0,0,173.7311567245588,56.02555408842269,,0,0,0,56.02555408842269,33.91660573132978,,0,0,0,33.91660573132978,120.64061871792651,,0,0,0,120.64061871792651
16,ILE,8.75197034105339,,0,0,0,8.75197034105339,4.519599882933734,,0,0,0,4.519599882933734,174.86021034844046,,0,0,0,174.86021034844046,61.20847186004551,,0,0,0,61.20847186004551,39.81112499254634,,0,0,0,39.81112499254634,124.27674172475858,,0,0,0,124.27674172475858
17,GLU,8.90152953927184,,0,0,0,8.90152953927184,4.537840537140637,,0,0,0,4.537840537140637,177.03479941913642,,0,0,0,177.03479941913642,54.51611854589854,,0,0,0,54.51611854589854,31.326979829054277,,0,0,0,31.326979829054277,127.22185791925297,,0,0,0,127.22185791925297
18,LYS,8.745907016128315,,0,0,0,8.745907016128315,4.069742653152403,,0,0,0,4.069742653152403,176.24521022288266,,0,0,0,176.24521022288266,58.661443791452996,,0,0,0,58.661443791452996,32.08475628843379,,0,0,0,32.08475628843379,120.92604380494507,,0,0,0,120.92604380494507
19,TYR,6.764379357470306,,0,0,0,6.764379357470306,4.650390441930292,,0,0,0,4.650390441930292,175.2421930471806,,0,0,0,175.2421930471806,57.39209821226551,,0,0,0,57.39209821226551,37.98827774044844,,0,0,0,37.98827774044844,113.83425365502275,,0,0,0,113.83425365502275
20,GLY,7.705375555772005,,0,0,0,7.705375555772005,4.08240005461483,,0,0,0,4.08240005461483,171.7610985433511,,0,0,0,171.7610985433511,44.86210867328227,,0,0,0,44.86210867328227,,,0,0,0,,108.71019951268175,,0,0,0,108.71019951268175
21,ALA,8.913960563974914,,0,0,0,8.913960563974914,5.116399946503496,,0,0,0,5.116399946503496,175.41380774739704,,0,0,0,175.41380774739704,50.15142747010212,,0,0,0,50.15142747010212,21.404673432450885,,0,0,0,21.404673432450885,122.26828215735931,,0,0,0,122.26828215735931
22,PHE,9.28825617887668,,0,0,0,9.28825617887668,5.4050133004662,,0,0,0,5.4050133004662,175.5163932233378,,0,0,0,175.5163932233378,57.368904621384175,,0,0,0,57.368904621384175,40.51793928080253,,0,0,0,40.51793928080253,121.48948637294927,,0,0,0,121.48948637294927
23,ILE,9.793980246736597,,0,0,0,9.793980246736597,5.078286816233767,,0,0,0,5.078286816233767,175.09118598537574,,0,0,0,175.09118598537574,59.70037978024198,,0,0,0,59.70037978024198,41.34539415477855,,0,0,0,41.34539415477855,122.48495629264625,,0,0,0,122.48495629264625
24,ASN,9.090655866827618,,0,0,0,9.090655866827618,5.494026200649351,,0,0,0,5.494026200649351,176.42571143786768,,0,0,0,176.42571143786768,52.19618605446775,,0,0,0,52.19618605446775,39.96223938346653,,0,0,0,39.96223938346653,126.2968394549839,,0,0,0,126.2968394549839
25,LEU,9.112272926295926,,0,0,0,9.112272926295926,4.469075724936175,,0,0,0,4.469075724936175,176.86029364240758,,0,0,0,176.86029364240758,56.268690087595736,,0,0,0,56.268690087595736,42.597638391941395,,0,0,0,42.597638391941395,124.63209838123544,,0,0,0,124.63209838123544
26,ASN,8.007250293245644,,0,0,0,8.007250293245644,4.763060592418693,,0,0,0,4.763060592418693,174.814588662987,,0,0,0,174.814588662987,52.274475651620605,,0,0,0,52.274475651620605,38.37409550282495,,0,0,0,38.37409550282495,115.30444877950939,,0,0,0,115.30444877950939
27,GLU,8.625920034260185,,0,0,0,8.625920034260185,4.179080104312354,,0,0,0,4.179080104312354,177.2328805938062,,0,0,0,177.2328805938062,58.74195453504274,,0,0,0,58.74195453504274,29.25944713052503,,0,0,0,29.25944713052503,117.62010623537019,,0,0,0,117.62010623537019
28,GLN,8.497237114557665,,0,0,0,8.497237114557665,4.487731622471973,,0,0,0,4.487731622471973,175.5270515400433,,0,0,0,175.5270515400433,56.03444907052392,,0,0,0,56.03444907052392,30.999695506138305,,0,0,0,30.999695506138305,116.67813689263514,,0,0,0,116.67813689263514
29,VAL,7.956472039022088,,0,0,0,7.956472039022088,4.29496192005772,,0,0,0,4.29496192005772,174.05559380077702,,0,0,0,174.05559380077702,62.2074048512765,,0,0,0,62.2074048512765,33.55965627131757,,0,0,0,33.55965627131757,120.20351349203574,,0,0,0,120.20351349203574
30,ARG,8.327715584382284,,0,0,0,8.327715584382284,5.50175644133644,,0,0,0,5.50175644133644,175.41382944714175,,0,0,0,175.41382944714175,54.144567047108445,,0,0,0,54.144567047108445,33.32480586026751,,0,0,0,33.32480586026751,127.85274187612387,,0,0,0,127.85274187612387
31,GLY,9.44429344888445,,0,0,0,9.44429344888445,3.8493189211704952,,0,0,0,3.8493189211704952,170.99787439504385,,0,0,0,170.99787439504385,44.212980447979795,,0,0,0,44.212980447979795,,,0,0,0,,112.46768012158397,,0,0,0,112.46768012158397
32,LEU,8.710409760755912,,0,0,0,8.710409760755912,4.910431188217339,,0,0,0,4.910431188217339,175.16831183071926,,0,0,0,175.16831183071926,53.7042089437063,,0,0,0,53.7042089437063,44.844152901970254,,0,0,0,44.844152901970254,121.6592215441725,,0,0,0,121.6592215441725
33,LEU,9.33921942887113,,0,0,0,9.33921942887113,4.967111195138195,,0,0,0,4.967111195138195,174.77802471416362,,0,0,0,174.77802471416362,53.521828182550784,,0,0,0,53.521828182550784,44.23564417771118,,0,0,0,44.23564417771118,130.0431928229326,,0,0,0,130.0431928229326
34,ARG,9.004780259274058,,0,0,0,9.004780259274058,5.019420181113332,,0,0,0,5.019420181113332,174.5826537407204,,0,0,0,174.5826537407204,53.52855073990454,,0,0,0,53.52855073990454,31.307350754995007,,0,0,0,31.307350754995007,128.10121174909534,,0,0,0,128.10121174909534
35,PRO,,,0,0,0,,4.443069351848152,,0,0,0,4.443069351848152,176.6373149996115,,0,0,0,176.6373149996115,64.85402858898878,,0,0,0,64.85402858898878,32.110062352997005,,0,0,0,32.110062352997005,,,0,0,0,
36,ARG,8.06709982816628,,0,0,0,8.06709982816628,4.231515363453213,,0,0,0,4.231515363453213,176.2799953986125,,0,0,0,176.2799953986125,57.91678733240093,,0,0,0,57.91678733240093,30.12094272933733,,0,0,0,30.12094272933733,117.37034057912643,,0,0,0,117.37034057912643
37,ASP,8.314367597025196,,0,0,0,8.314367597025196,4.968073436796537,,0,0,0,4.968073436796537,174.82404130628817,,0,0,0,174.82404130628817,54.29458316093351,,0,0,0,54.29458316093351,42.206961216400266,,0,0,0,42.206961216400266,119.24662273529805,,0,0,0,119.24662273529805
38,MET,8.174413115506715,,0,0,0,8.174413115506715,4.864390058524808,,0,0,0,4.864390058524808,175.83267651451882,,0,0,0,175.83267651451882,55.19347437217227,,0,0,0,55.19347437217227,32.70906549158064,,0,0,0,32.70906549158064,120.4162962619214,,0,0,0,120.4162962619214
39,ILE,8.998001813125763,,0,0,0,8.998001813125763,4.2182846373737375,,0,0,0,4.2182846373737375,176.54005755334666,,0,0,0,176.54005755334666,61.13165703972694,,0,0,0,61.13165703972694,37.97678026444111,,0,0,0,37.97678026444111,125.78587631762682,,0,0,0,125.78587631762682
40,SER,8.661585616766567,,0,0,0,8.661585616766567,4.347599453632478,,0,0,0,4.347599453632478,173.88187917377067,,0,0,0,173.88187917377067,59.17772039070374,,0,0,0,59.17772039070374,63.02762968719613,,0,0,0,63.02762968719613,119.58429481010656,,0,0,0,119.58429481010656
41,LEU,7.740751172971473,,0,0,0,7.740751172971473,4.459557698124098,,0,0,0,4.459557698124098,175.67486844261848,,0,0,0,175.67486844261848,54.04756617160617,,0,0,0,54.04756617160617,43.978137049506046,,0,0,0,43.978137049506046,122.9335126553502,,0,0,0,122.9335126553502
42,ARG,8.337326122272172,,0,0,0,8.337326122272172,4.625611154095904,,0,0,0,4.625611154095904,177.6167833427739,,0,0,0,177.6167833427739,54.055062466405815,,0,0,0,54.055062466405815,32.579436892568545,,0,0,0,32.579436892568545,124.27560263120213,,0,0,0,124.27560263120213
43,LEU,8.703849143584193,,0,0,0,8.703849143584193,3.8721447090243095,,0,0,0,3.8721447090243095,178.31744926261516,,0,0,0,178.31744926261516,58.161714819513826,,0,0,0,58.161714819513826,41.762110844300146,,0,0,0,41.762110844300146,125.5979565090465,,0,0,0,125.5979565090465
44,GLU,9.07519195898546,,0,0,0,9.07519195898546,4.105893258200133,,0,0,0,4.105893258200133,177.2920754967033,,0,0,0,177.2920754967033,58.35760531959152,,0,0,0,58.35760531959152,28.567430764385612,,0,0,0,28.567430764385612,115.48793395500056,,0,0,0,115.48793395500056
45,ASN,7.780129030397381,,0,0,0,7.780129030397381,4.734656444794095,,0,0,0,4.734656444794095,175.385215827084,,0,0,0,175.385215827084,53.09494086828172,,0,0,0,53.09494086828172,39.17069469300699,,0,0,0,39.17069469300699,116.47826331531802,,0,0,0,116.47826331531802
46,LEU,7.385706254600954,,0,0,0,7.385706254600954,4.424024157525808,,0,0,0,4.424024157525808,176.13791518256187,,0,0,0,176.13791518256187,54.25308606075591,,0,0,0,54.25308606075591,43.11101725717616,,0,0,0,43.11101725717616,120.68943764187479,,0,0,0,120.68943764187479
47,ASN,8.869682461155511,,0,0,0,8.869682461155511,4.834611735897436,,0,0,0,4.834611735897436,174.98238507576312,,0,0,0,174.98238507576312,51.97487594969475,,0,0,0,51.97487594969475,40.74098936272061,,0,0,0,40.74098936272061,119.83269546518481,,0,0,0,119.83269546518481
48,VAL,8.288978683127983,,0,0,0,8.288978683127983,3.4431478257686754,,0,0,0,3.4431478257686754,177.40763036841494,,0,0,0,177.40763036841494,64.92864223385503,,0,0,0,64.92864223385503,31.450926100072152,,0,0,0,31.450926100072152,120.97080612874348,,0,0,0,120.97080612874348
49,GLY,8.948518031512931,,0,0,0,8.948518031512931,3.9728166761016768,,0,0,0,3.9728166761016768,174.5264574585137,,0,0,0,174.5264574585137,44.8463659000222,,0,0,0,44.8463659000222,,,0,0,0,,116.54007590115995,,0,0,0,116.54007590115995
50,ASP,7.862789348651348,,0,0,0,7.862789348651348,4.653172969585969,,0,0,0,4.653172969585969,175.84549530708736,,0,0,0,175.84549530708736,55.369291974808526,,0,0,0,55.369291974808526,41.37671438923854,,0,0,0,41.37671438923854,122.52094342115663,,0,0,0,122.52094342115663
51,GLU,8.571743522399823,,0,0,0,8.571743522399823,5.225474314807414,,0,0,0,5.225474314807414,175.93891029062047,,0,0,0,175.93891029062047,55.79257189141969,,0,0,0,55.79257189141969,30.569945848107448,,0,0,0,30.569945848107448,122.98777774563214,,0,0,0,122.98777774563214
52,ILE,8.996235607165058,,0,0,0,8.996235607165058,4.674480675613276,,0,0,0,4.674480675613276,174.12741236031192,,0,0,0,174.12741236031192,59.56566138916084,,0,0,0,59.56566138916084,41.84678969074814,,0,0,0,41.84678969074814,119.8153003526085,,0,0,0,119.8153003526085
53,ILE,8.433831238045288,,0,0,0,8.433831238045288,4.8217452290986795,,0,0,0,4.8217452290986795,175.7910774060939,,0,0,0,175.7910774060939,60.19889152356532,,0,0,0,60.19889152356532,38.19922391598956,,0,0,0,38.19922391598956,124.0064365948385,,0,0,0,124.0064365948385
54,VAL,9.270628805450105,,0,0,0,9.270628805450105,4.928347693911643,,0,0,0,4.928347693911643,174.01828384025418,,0,0,0,174.01828384025418,58.69105226669997,,0,0,0,58.69105226669997,34.96738546290931,,0,0,0,34.96738546290931,122.81396341797092,,0,0,0,122.81396341797092
55,GLN,8.948493059085358,,0,0,0,8.948493059085358,4.6152792959595965,,0,0,0,4.6152792959595965,175.24658678929404,,0,0,0,175.24658678929404,54.37368442964813,,0,0,0,54.37368442964813,30.489851457131756,,0,0,0,30.489851457131756,125.39948800926295,,0,0,0,125.39948800926295
56,ALA,9.000073473298924,,0,0,0,9.000073473298924,4.695543261704962,,0,0,0,4.695543261704962,176.29906518374403,,0,0,0,176.29906518374403,52.6856171001443,,0,0,0,52.6856171001443,19.418885253896107,,0,0,0,19.418885253896107,129.0590997423188,,0,0,0,129.0590997423188
57,ILE,8.92741724146964,,0,0,0,8.92741724146964,4.097157768636919,,0,0,0,4.097157768636919,175.84302797117883,,0,0,0,175.84302797117883,61.95435405944611,,0,0,0,61.95435405944611,38.85669510211455,,0,0,0,38.85669510211455,124.02804499100344,,0,0,0,124.02804499100344
58,ASP,7.667190362898213,,0,0,0,7.667190362898213,4.869752157498057,,0,0,0,4.869752157498057,174.22393585705407,,0,0,0,174.22393585705407,53.3903075462593,,0,0,0,53.3903075462593,44.06693628089688,,0,0,0,44.06693628089688,117.72763242584082,,0,0,0,117.72763242584082
59,VAL,8.61870928087468,,0,0,0,8.61870928087468,4.378339716361416,,0,0,0,4.378339716361416,174.50913277145634,,0,0,0,174.50913277145634,62.00869377962593,,0,0,0,62.00869377962593,33.66962762676213,,0,0,0,33.66962762676213,124.39171714879011,,0,0,0,124.39171714879011
60,ARG,8.712789487279387,,0,0,0,8.712789487279387,4.992990215623267,,0,0,0,4.992990215623267,174.480452108214,,0,0,0,174.480452108214,52.8221207021645,,0,0,0,52.8221207021645,31.14321946897547,,0,0,0,31.14321946897547,127.91045010630481,,0,0,0,127.91045010630481
61,PRO,,,0,0,0,,4.248075243084693,,0,0,0,4.248075243084693,177.5922968411311,,0,0,0,177.5922968411311,64.66339258448218,,0,0,0,64.66339258448218,32.124463662609614,,0,0,0,32.124463662609614,,,0,0,0,
62,GLU,8.953393082067931,,0,0,0,8.953393082067931,4.135568435619936,,0,0,0,4.135568435619936,177.67028428816738,,0,0,0,177.67028428816738,58.45697582100677,,0,0,0,58.45697582100677,29.027965566766568,,0,0,0,29.027965566766568,117.80777727511378,,0,0,0,117.80777727511378
63,LYS,7.771508546592296,,0,0,0,7.771508546592296,4.3806436156066155,,0,0,0,4.3806436156066155,175.73396633446552,,0,0,0,175.73396633446552,55.82757502657898,,0,0,0,55.82757502657898,32.98865634920635,,0,0,0,32.98865634920635,117.92341487288823,,0,0,0,117.92341487288823
64,ARG,7.942593284726385,,0,0,0,7.942593284726385,3.796712161790987,,0,0,0,3.796712161790987,174.5553884199745,,0,0,0,174.5553884199745,56.83887480281385,,0,0,0,56.83887480281385,27.027864661482962,,0,0,0,27.027864661482962,117.44042411188812,,0,0,0,117.44042411188812
65,GLU,7.8762524489232995,,0,0,0,7.8762524489232995,4.974597332106782,,0,0,0,4.974597332106782,174.5474085612776,,0,0,0,174.5474085612776,55.15809657357087,,0,0,0,55.15809657357087,33.32635586371961,,0,0,0,33.32635586371961,116.12733878629705,,0,0,0,116.12733878629705
66,ILE,8.164741526673327,,0,0,0,8.164741526673327,4.703121444505495,,0,0,0,4.703121444505495,173.76360178036964,,0,0,0,173.76360178036964,59.469509069180816,,0,0,0,59.469509069180816,41.2229275020979,,0,0,0,41.2229275020979,120.65155586743812,,0,0,0,120.65155586743812
67,ASP,8.565247063858363,,0,0,0,8.565247063858363,5.122663771434122,,0,0,0,5.122663771434122,175.11551241478523,,0,0,0,175.11551241478523,53.414905482983684,,0,0,0,53.414905482983684,42.606352581357534,,0,0,0,42.606352581357534,126.64771062982574,,0,0,0,126.64771062982574
68,PHE,9.012113144361194,,0,0,0,9.012113144361194,5.699102583583084,,0,0,0,5.699102583583084,175.61466889418915,,0,0,0,175.61466889418915,55.094277798823406,,0,0,0,55.094277798823406,41.97815507777223,,0,0,0,41.97815507777223,122.15930221013431,,0,0,0,122.15930221013431
69,LYS,9.317337773654122,,0,0,0,9.317337773654122,5.030700431934732,,0,0,0,5.030700431934732,174.86174456951937,,0,0,0,174.86174456951937,54.37577880668776,,0,0,0,54.37577880668776,36.53806911221557,,0,0,0,36.53806911221557,121.34374044289045,,0,0,0,121.34374044289045
70,TYR,9.322938387468088,,0,0,0,9.322938387468088,4.977238764885115,,0,0,0,4.977238764885115,174.76271441305917,,0,0,0,174.76271441305917,57.65746022449217,,0,0,0,57.65746022449217,40.66294374362304,,0,0,0,40.66294374362304,125.98294492224997,,0,0,0,125.98294492224997
71,ILE,7.831755965739816,,0,0,0,7.831755965739816,4.537553125041625,,0,0,0,4.537553125041625,172.9743470404651,,0,0,0,172.9743470404651,57.7852601015651,,0,0,0,57.7852601015651,39.717272378460436,,0,0,0,39.717272378460436,126.85583450477301,,0,0,0,126.85583450477301
72,PRO,,,0,0,0,,4.2770424187728935,,0,0,0,4.2770424187728935,176.50795440913532,,0,0,0,176.50795440913532,63.107063375180374,,0,0,0,63.107063375180374,31.77733150836941,,0,0,0,31.77733150836941,,,0,0,0,
73,LEU,8.328667055699857,,0,0,0,8.328667055699857,4.35510583003108,,0,0,0,4.35510583003108,177.2041539995449,,0,0,0,177.2041539995449,55.03874545672106,,0,0,0,55.03874545672106,42.18062181855367,,0,0,0,42.18062181855367,124.41941837621822,,0,0,0,124.41941837621822
74,GLU,8.28321382951493,,0,0,0,8.28321382951493,4.158548337723387,,0,0,0,4.158548337723387,177.90711317453656,,0,0,0,177.90711317453656,57.5637291488012,,0,0,0,57.5637291488012,30.748037484077035,,0,0,0,30.748037484077035,125.35722632527472,,0,0,0,125.35722632527472
