RESNUM,RESNAME,H_X,H_Y,H_BEST_REF_SCORE,H_BEST_REF_COV,H_BEST_REF_MATCH,H_UCBShift,HA_X,HA_Y,HA_BEST_REF_SCORE,HA_BEST_REF_COV,HA_BEST_REF_MATCH,HA_UCBShift,C_X,C_Y,C_BEST_REF_SCORE,C_BEST_REF_COV,C_BEST_REF_MATCH,C_UCBShift,CA_X,CA_Y,CA_BEST_REF_SCORE,CA_BEST_REF_COV,CA_BEST_REF_MATCH,CA_UCBShift,CB_X,CB_Y,CB_BEST_REF_SCORE,CB_BEST_REF_COV,CB_BEST_REF_MATCH,CB_UCBShift,N_X,N_Y,N_BEST_REF_SCORE,N_BEST_REF_COV,N_BEST_REF_MATCH,N_UCBShift
1,MET,8.33090428145743,,0,0,0,8.33090428145743,4.432383010536685,,0,0,0,4.432383010536685,174.6280065817183,,0,0,0,174.6280065817183,55.237746553441,,0,0,0,55.237746553441,33.16894539292374,,0,0,0,33.16894539292374,121.04453070604396,,0,0,0,121.04453070604396
2,LYS,8.260303424819625,,0,0,0,8.260303424819625,4.546660839024864,,0,0,0,4.546660839024864,174.43764375239206,,0,0,0,174.43764375239206,54.199247278754584,,0,0,0,54.199247278754584,32.54525607496948,,0,0,0,32.54525607496948,124.5799524012654,,0,0,0,124.5799524012654
3,PRO,,,0,0,0,,4.4985904967171715,,0,0,0,4.4985904967171715,176.63335116683317,,0,0,0,176.63335116683317,62.890628647857696,,0,0,0,62.890628647857696,31.734426202442005,,0,0,0,31.734426202442005,,,0,0,0,
4,GLU,8.47088304854035,,0,0,0,8.47088304854035,4.173358342271618,,0,0,0,4.173358342271618,176.96488342373738,,0,0,0,176.96488342373738,56.54385833240093,,0,0,0,56.54385833240093,29.689092195598846,,0,0,0,29.689092195598846,122.67469152600732,,0,0,0,122.67469152600732
5,HIS,8.598678618315018,,0,0,0,8.598678618315018,4.398362201598402,,0,0,0,4.398362201598402,174.76876089337884,,0,0,0,174.76876089337884,56.115531882362085,,0,0,0,56.115531882362085,28.723495840870243,,0,0,0,28.723495840870243,122.10741416979133,,0,0,0,122.10741416979133
6,ARG,8.171489340293041,,0,0,0,8.171489340293041,4.205703303715729,,0,0,0,4.205703303715729,175.87871327816075,,0,0,0,175.87871327816075,56.29174693282828,,0,0,0,56.29174693282828,30.76882484124209,,0,0,0,30.76882484124209,123.59155117312687,,0,0,0,123.59155117312687
7,MET,8.386652044527693,,0,0,0,8.386652044527693,4.259784368531468,,0,0,0,4.259784368531468,175.65254695359087,,0,0,0,175.65254695359087,55.32534762479742,,0,0,0,55.32534762479742,32.98174404246864,,0,0,0,32.98174404246864,123.7170915114774,,0,0,0,123.7170915114774
8,ASP,8.452725117665668,,0,0,0,8.452725117665668,4.624497557126207,,0,0,0,4.624497557126207,176.30376664081476,,0,0,0,176.30376664081476,54.20212043623044,,0,0,0,54.20212043623044,40.87628486941947,,0,0,0,40.87628486941947,123.13571194239094,,0,0,0,123.13571194239094
9,THR,8.070702824836275,,0,0,0,8.070702824836275,4.448531316838716,,0,0,0,4.448531316838716,175.83575526702185,,0,0,0,175.83575526702185,61.455749286108336,,0,0,0,61.455749286108336,69.96385603727383,,0,0,0,69.96385603727383,113.771560015651,,0,0,0,113.771560015651
10,ILE,9.863716523926076,,0,0,0,9.863716523926076,3.740483738156287,,0,0,0,3.740483738156287,177.8111114393995,,0,0,0,177.8111114393995,64.39397799455544,,0,0,0,64.39397799455544,37.82429419961705,,0,0,0,37.82429419961705,122.7496299947053,,0,0,0,122.7496299947053
11,SER,8.396055205971807,,0,0,0,8.396055205971807,4.25269839522977,,0,0,0,4.25269839522977,175.5978522543623,,0,0,0,175.5978522543623,60.51655965873571,,0,0,0,60.51655965873571,63.0391425560051,,0,0,0,63.0391425560051,114.70741580742036,,0,0,0,114.70741580742036
12,LYS,7.762516741797091,,0,0,0,7.762516741797091,4.41378051048396,,0,0,0,4.41378051048396,176.73793504902875,,0,0,0,176.73793504902875,55.72076167991453,,0,0,0,55.72076167991453,32.91628288922744,,0,0,0,32.91628288922744,120.60280966302587,,0,0,0,120.60280966302587
13,LEU,7.130047883300033,,0,0,0,7.130047883300033,4.234405242382618,,0,0,0,4.234405242382618,176.12779311191585,,0,0,0,176.12779311191585,55.72483288319458,,0,0,0,55.72483288319458,42.36770698071928,,0,0,0,42.36770698071928,121.2888198598346,,0,0,0,121.2888198598346
14,GLU,8.402044955583305,,0,0,0,8.402044955583305,4.564827049667,,0,0,0,4.564827049667,176.36594652780553,,0,0,0,176.36594652780553,54.71225117837718,,0,0,0,54.71225117837718,31.751278819674766,,0,0,0,31.751278819674766,120.93070444134754,,0,0,0,120.93070444134754
15,GLU,8.572485615984016,,0,0,0,8.572485615984016,3.8985661726301473,,0,0,0,3.8985661726301473,177.39726423614164,,0,0,0,177.39726423614164,58.27917097934288,,0,0,0,58.27917097934288,29.458972876023974,,0,0,0,29.458972876023974,121.64747495548896,,0,0,0,121.64747495548896
16,GLY,9.040862957298257,,0,0,0,9.040862957298257,3.957650314735265,,0,0,0,3.957650314735265,174.02687059528805,,0,0,0,174.02687059528805,45.26888389205794,,0,0,0,45.26888389205794,,,0,0,0,,113.43337770042734,,0,0,0,113.43337770042734
17,ALA,7.70001183966589,,0,0,0,7.70001183966589,4.321816623212898,,0,0,0,4.321816623212898,176.6650246812854,,0,0,0,176.6650246812854,52.396863262892666,,0,0,0,52.396863262892666,19.765519964962817,,0,0,0,19.765519964962817,123.97847217974248,,0,0,0,123.97847217974248
18,GLU,8.611898560295261,,0,0,0,8.611898560295261,5.000873410628261,,0,0,0,5.000873410628261,176.13925648428793,,0,0,0,176.13925648428793,55.86436656843712,,0,0,0,55.86436656843712,29.77672992287157,,0,0,0,29.77672992287157,121.18880105473416,,0,0,0,121.18880105473416
19,THR,7.984372145770896,,0,0,0,7.984372145770896,4.65402173975469,,0,0,0,4.65402173975469,172.28414207178932,,0,0,0,172.28414207178932,59.10470760351315,,0,0,0,59.10470760351315,70.55520537668443,,0,0,0,70.55520537668443,118.99205588098013,,0,0,0,118.99205588098013
20,PRO,,,0,0,0,,4.701639077086802,,0,0,0,4.701639077086802,176.25482962669554,,0,0,0,176.25482962669554,62.88675153678543,,0,0,0,62.88675153678543,32.41734525763681,,0,0,0,32.41734525763681,,,0,0,0,
21,VAL,8.688710484559884,,0,0,0,8.688710484559884,4.521316292707293,,0,0,0,4.521316292707293,174.32755097266622,,0,0,0,174.32755097266622,60.24574483179043,,0,0,0,60.24574483179043,34.55162468159063,,0,0,0,34.55162468159063,118.22370730994007,,0,0,0,118.22370730994007
22,THR,8.425734936330336,,0,0,0,8.425734936330336,5.432665852608503,,0,0,0,5.432665852608503,173.99676586424684,,0,0,0,173.99676586424684,61.21849206157176,,0,0,0,61.21849206157176,71.21999482286603,,0,0,0,71.21999482286603,119.80321282176712,,0,0,0,119.80321282176712
23,GLY,8.835731798945499,,0,0,0,8.835731798945499,4.111640142107893,,0,0,0,4.111640142107893,171.85123531536797,,0,0,0,171.85123531536797,46.02184690138195,,0,0,0,46.02184690138195,,,0,0,0,,111.35001324418359,,0,0,0,111.35001324418359
24,ARG,8.995481200055501,,0,0,0,8.995481200055501,4.78799933036408,,0,0,0,4.78799933036408,176.3485967367355,,0,0,0,176.3485967367355,55.441461254761904,,0,0,0,55.441461254761904,31.5824382994894,,0,0,0,31.5824382994894,121.71080711776001,,0,0,0,121.71080711776001
25,VAL,9.304250991386391,,0,0,0,9.304250991386391,4.198862831734932,,0,0,0,4.198862831734932,176.222980793451,,0,0,0,176.222980793451,64.01649233277834,,0,0,0,64.01649233277834,31.43150191088356,,0,0,0,31.43150191088356,126.404216047003,,0,0,0,126.404216047003
26,MET,9.01075048169053,,0,0,0,9.01075048169053,4.516635273543123,,0,0,0,4.516635273543123,176.50785882977578,,0,0,0,176.50785882977578,56.15848183204018,,0,0,0,56.15848183204018,33.18434646250416,,0,0,0,33.18434646250416,127.32445500892442,,0,0,0,127.32445500892442
27,LYS,7.8713653154956145,,0,0,0,7.8713653154956145,4.543286478471528,,0,0,0,4.543286478471528,173.94139229247418,,0,0,0,173.94139229247418,55.70786740733711,,0,0,0,55.70786740733711,35.983136893284495,,0,0,0,35.983136893284495,117.5634592866023,,0,0,0,117.5634592866023
28,ILE,8.737149476118327,,0,0,0,8.737149476118327,4.3762022879315134,,0,0,0,4.3762022879315134,175.64449021233213,,0,0,0,175.64449021233213,60.963724456998555,,0,0,0,60.963724456998555,39.10963258630814,,0,0,0,39.10963258630814,124.97202814007659,,0,0,0,124.97202814007659
29,SER,8.959498758152959,,0,0,0,8.959498758152959,4.799547771916972,,0,0,0,4.799547771916972,174.28516923858362,,0,0,0,174.28516923858362,58.31055104161394,,0,0,0,58.31055104161394,64.56228563125208,,0,0,0,64.56228563125208,123.94650126735488,,0,0,0,123.94650126735488
30,SER,8.478046777045178,,0,0,0,8.478046777045178,4.6135770552170055,,0,0,0,4.6135770552170055,173.31960741660006,,0,0,0,173.31960741660006,56.28283558326118,,0,0,0,56.28283558326118,62.99087081003996,,0,0,0,62.99087081003996,117.79811959069264,,0,0,0,117.79811959069264
31,PRO,,,0,0,0,,4.485828907403707,,0,0,0,4.485828907403707,176.64397958492066,,0,0,0,176.64397958492066,63.23356334710844,,0,0,0,63.23356334710844,31.926576093839493,,0,0,0,31.926576093839493,,,0,0,0,
32,ARG,8.756692937451438,,0,0,0,8.756692937451438,4.818222035292485,,0,0,0,4.818222035292485,175.54867028770119,,0,0,0,175.54867028770119,54.53048052882673,,0,0,0,54.53048052882673,33.17468071065601,,0,0,0,33.17468071065601,123.73599391139416,,0,0,0,123.73599391139416
33,THR,8.36890901934177,,0,0,0,8.36890901934177,5.297898023065822,,0,0,0,5.297898023065822,174.5288551663281,,0,0,0,174.5288551663281,60.55912265295815,,0,0,0,60.55912265295815,70.40266686230436,,0,0,0,70.40266686230436,115.82256125858031,,0,0,0,115.82256125858031
34,PHE,9.01923657005217,,0,0,0,9.01923657005217,5.050865657392607,,0,0,0,5.050865657392607,173.11601622357642,,0,0,0,173.11601622357642,55.9411209038739,,0,0,0,55.9411209038739,41.363408222000224,,0,0,0,41.363408222000224,121.20373915839716,,0,0,0,121.20373915839716
35,THR,8.643804937728937,,0,0,0,8.643804937728937,4.7391845506771,,0,0,0,4.7391845506771,174.77873106310355,,0,0,0,174.77873106310355,62.35372537213897,,0,0,0,62.35372537213897,69.43809121389167,,0,0,0,69.43809121389167,118.08922985394605,,0,0,0,118.08922985394605
36,THR,8.706556171545122,,0,0,0,8.706556171545122,4.520692251215451,,0,0,0,4.520692251215451,175.99503014976133,,0,0,0,175.99503014976133,61.53112085357975,,0,0,0,61.53112085357975,70.66071079784659,,0,0,0,70.66071079784659,118.82700117804973,,0,0,0,118.82700117804973
37,ARG,8.860616176906428,,0,0,0,8.860616176906428,4.177198761427461,,0,0,0,4.177198761427461,177.16846760386838,,0,0,0,177.16846760386838,57.906030315301365,,0,0,0,57.906030315301365,29.993596227744476,,0,0,0,29.993596227744476,122.26472794855145,,0,0,0,122.26472794855145
38,LYS,8.0082738518315,,0,0,0,8.0082738518315,4.3503648957042955,,0,0,0,4.3503648957042955,177.13135018543124,,0,0,0,177.13135018543124,55.79133286633922,,0,0,0,55.79133286633922,32.31278346343657,,0,0,0,32.31278346343657,117.91531783645245,,0,0,0,117.91531783645245
39,GLY,8.102658034704184,,0,0,0,8.102658034704184,3.9480395615329114,,0,0,0,3.9480395615329114,174.35526875044957,,0,0,0,174.35526875044957,45.50486147691198,,0,0,0,45.50486147691198,,,0,0,0,,109.00237753533133,,0,0,0,109.00237753533133
40,ARG,7.748312412848263,,0,0,0,7.748312412848263,4.460919051409701,,0,0,0,4.460919051409701,175.4612421438062,,0,0,0,175.4612421438062,55.42496979368409,,0,0,0,55.42496979368409,31.250717314135862,,0,0,0,31.250717314135862,120.89571294163613,,0,0,0,120.89571294163613
41,GLU,8.594920318020868,,0,0,0,8.594920318020868,4.481080952935953,,0,0,0,4.481080952935953,175.8462561692807,,0,0,0,175.8462561692807,56.8247202546731,,0,0,0,56.8247202546731,30.41471408356088,,0,0,0,30.41471408356088,122.69085496672217,,0,0,0,122.69085496672217
42,GLY,8.672126417765568,,0,0,0,8.672126417765568,3.6762877180402933,,0,0,0,3.6762877180402933,172.1696498309857,,0,0,0,172.1696498309857,44.30948285436231,,0,0,0,44.30948285436231,,,0,0,0,,113.07451241232656,,0,0,0,113.07451241232656
43,LYS,8.905629294888445,,0,0,0,8.905629294888445,5.389351833477633,,0,0,0,5.389351833477633,174.86240040896325,,0,0,0,174.86240040896325,55.005241745715395,,0,0,0,55.005241745715395,36.1424598060939,,0,0,0,36.1424598060939,120.71477211719392,,0,0,0,120.71477211719392
44,LEU,9.132679161671664,,0,0,0,9.132679161671664,5.200507163858364,,0,0,0,5.200507163858364,175.00980308190697,,0,0,0,175.00980308190697,53.5236931499778,,0,0,0,53.5236931499778,45.825066229320676,,0,0,0,45.825066229320676,124.53622849753579,,0,0,0,124.53622849753579
45,ALA,8.87613187032967,,0,0,0,8.87613187032967,4.7954327261682765,,0,0,0,4.7954327261682765,175.22506239979467,,0,0,0,175.22506239979467,50.46003174081474,,0,0,0,50.46003174081474,23.4931898535187,,0,0,0,23.4931898535187,127.58839951117216,,0,0,0,127.58839951117216
46,ASN,8.712335777145078,,0,0,0,8.712335777145078,5.514256078699079,,0,0,0,5.514256078699079,174.38929849612055,,0,0,0,174.38929849612055,52.37890411541237,,0,0,0,52.37890411541237,40.876914953069154,,0,0,0,40.876914953069154,119.3647443396326,,0,0,0,119.3647443396326
47,VAL,9.274728568870017,,0,0,0,9.274728568870017,4.874036518936618,,0,0,0,4.874036518936618,174.42390525709845,,0,0,0,174.42390525709845,60.51502316396381,,0,0,0,60.51502316396381,34.588042542324345,,0,0,0,34.588042542324345,124.52014320002776,,0,0,0,124.52014320002776
48,ILE,9.142781197985348,,0,0,0,9.142781197985348,4.900854123898324,,0,0,0,4.900854123898324,176.01175514538795,,0,0,0,176.01175514538795,59.437669757808855,,0,0,0,59.437669757808855,37.479992346675544,,0,0,0,37.479992346675544,126.72653970631036,,0,0,0,126.72653970631036
49,ILE,9.271679929304028,,0,0,0,9.271679929304028,5.248381938927739,,0,0,0,5.248381938927739,174.32129744892885,,0,0,0,174.32129744892885,58.241697510572756,,0,0,0,58.241697510572756,41.01142391894772,,0,0,0,41.01142391894772,124.08786323675214,,0,0,0,124.08786323675214
50,ALA,8.79693703009213,,0,0,0,8.79693703009213,5.441362027317127,,0,0,0,5.441362027317127,175.9232797256355,,0,0,0,175.9232797256355,50.26494264979465,,0,0,0,50.26494264979465,23.000209283161286,,0,0,0,23.000209283161286,125.2458255123543,,0,0,0,125.2458255123543
51,ASP,8.735946065312465,,0,0,0,8.735946065312465,4.960158892757243,,0,0,0,4.960158892757243,177.2035874954934,,0,0,0,177.2035874954934,53.04836355564436,,0,0,0,53.04836355564436,42.88659388059718,,0,0,0,42.88659388059718,121.8345657363914,,0,0,0,121.8345657363914
52,ASP,8.572171697913198,,0,0,0,8.572171697913198,4.4005945570207565,,0,0,0,4.4005945570207565,176.97131414001,,0,0,0,176.97131414001,56.29418335911866,,0,0,0,56.29418335911866,40.33165798672439,,0,0,0,40.33165798672439,117.32495207238318,,0,0,0,117.32495207238318
53,THR,7.775540182572983,,0,0,0,7.775540182572983,4.468052407622932,,0,0,0,4.468052407622932,174.67819373961038,,0,0,0,174.67819373961038,61.89432629903985,,0,0,0,61.89432629903985,70.38744570624931,,0,0,0,70.38744570624931,108.81491831313686,,0,0,0,108.81491831313686
54,GLY,7.954800276340326,,0,0,0,7.954800276340326,4.1203757597236095,,0,0,0,4.1203757597236095,171.7813094912088,,0,0,0,171.7813094912088,45.183809032955935,,0,0,0,45.183809032955935,,,0,0,0,,110.27194655030524,,0,0,0,110.27194655030524
55,GLU,8.416869860800311,,0,0,0,8.416869860800311,5.1329009600344095,,0,0,0,5.1329009600344095,175.5218393602342,,0,0,0,175.5218393602342,55.36802241310912,,0,0,0,55.36802241310912,31.806919457625707,,0,0,0,31.806919457625707,120.0654180979798,,0,0,0,120.0654180979798
56,LEU,8.936806218048618,,0,0,0,8.936806218048618,4.7777815804750805,,0,0,0,4.7777815804750805,174.90569491691642,,0,0,0,174.90569491691642,53.6769703010767,,0,0,0,53.6769703010767,45.916349017743364,,0,0,0,45.916349017743364,125.81198784082584,,0,0,0,125.81198784082584
57,ARG,8.941478467316017,,0,0,0,8.941478467316017,4.9302634362026865,,0,0,0,4.9302634362026865,175.14658706414698,,0,0,0,175.14658706414698,55.51442158368853,,0,0,0,55.51442158368853,31.777474037867687,,0,0,0,31.777474037867687,126.8429409060939,,0,0,0,126.8429409060939
58,ALA,9.33089387040737,,0,0,0,9.33089387040737,5.1742554994561,,0,0,0,5.1742554994561,175.77992365895773,,0,0,0,175.77992365895773,50.185839904884006,,0,0,0,50.185839904884006,20.890440261466313,,0,0,0,20.890440261466313,130.91255945019424,,0,0,0,130.91255945019424
59,VAL,8.882170626495725,,0,0,0,8.882170626495725,4.463435029104229,,0,0,0,4.463435029104229,175.40114556471306,,0,0,0,175.40114556471306,61.35948834846265,,0,0,0,61.35948834846265,32.11716621080586,,0,0,0,32.11716621080586,125.12404130101011,,0,0,0,125.12404130101011
60,PHE,9.45857946986902,,0,0,0,9.45857946986902,4.6375822302919305,,0,0,0,4.6375822302919305,174.79176294784105,,0,0,0,174.79176294784105,56.72280234622045,,0,0,0,56.72280234622045,40.73698589034299,,0,0,0,40.73698589034299,127.16387237353757,,0,0,0,127.16387237353757
61,TRP,8.840727834049284,,0,0,0,8.840727834049284,5.171985533921634,,0,0,0,5.171985533921634,177.8306572605006,,0,0,0,177.8306572605006,56.681895686807636,,0,0,0,56.681895686807636,31.052969201315353,,0,0,0,31.052969201315353,123.39114947498612,,0,0,0,123.39114947498612
62,THR,8.542956988300588,,0,0,0,8.542956988300588,4.001126553934954,,0,0,0,4.001126553934954,176.32401957623486,,0,0,0,176.32401957623486,65.6362369510323,,0,0,0,65.6362369510323,68.79806916916972,,0,0,0,68.79806916916972,115.15258767978132,,0,0,0,115.15258767978132
63,GLU,9.166502791980243,,0,0,0,9.166502791980243,4.2981452859862355,,0,0,0,4.2981452859862355,177.55666926442447,,0,0,0,177.55666926442447,58.2889761980908,,0,0,0,58.2889761980908,29.065296106182707,,0,0,0,29.065296106182707,119.41695317226107,,0,0,0,119.41695317226107
64,ASN,8.28995230908536,,0,0,0,8.28995230908536,4.854820493772895,,0,0,0,4.854820493772895,176.6109587386003,,0,0,0,176.6109587386003,54.2711904029082,,0,0,0,54.2711904029082,39.14958474169164,,0,0,0,39.14958474169164,116.80689096193807,,0,0,0,116.80689096193807
65,ILE,8.06912999053724,,0,0,0,8.06912999053724,3.9038660382978128,,0,0,0,3.9038660382978128,177.2274652356255,,0,0,0,177.2274652356255,64.29423691454102,,0,0,0,64.29423691454102,36.500520518786765,,0,0,0,36.500520518786765,121.18652845601066,,0,0,0,121.18652845601066
66,LYS,8.127266862565211,,0,0,0,8.127266862565211,4.179820746284271,,0,0,0,4.179820746284271,178.32212258931622,,0,0,0,178.32212258931622,58.142804465023865,,0,0,0,58.142804465023865,31.82335006914752,,0,0,0,31.82335006914752,117.43504523889999,,0,0,0,117.43504523889999
67,LEU,8.041771585553336,,0,0,0,8.041771585553336,4.279185320981797,,0,0,0,4.279185320981797,178.54582810770341,,0,0,0,178.54582810770341,56.73584226115551,,0,0,0,56.73584226115551,41.76613256082806,,0,0,0,41.76613256082806,119.18280638728493,,0,0,0,119.18280638728493
68,LEU,7.594244859068709,,0,0,0,7.594244859068709,3.3805398528887776,,0,0,0,3.3805398528887776,177.76992433668,,0,0,0,177.76992433668,56.27362373073593,,0,0,0,56.27362373073593,40.586558223570876,,0,0,0,40.586558223570876,116.71567524175823,,0,0,0,116.71567524175823
69,LYS,7.561946237090687,,0,0,0,7.561946237090687,4.0147227245893,,0,0,0,4.0147227245893,177.4290369599234,,0,0,0,177.4290369599234,57.57618226317572,,0,0,0,57.57618226317572,32.2093752954712,,0,0,0,32.2093752954712,117.48299296527917,,0,0,0,117.48299296527917
70,LYS,7.77758829113664,,0,0,0,7.77758829113664,4.269236488073038,,0,0,0,4.269236488073038,175.79292104354533,,0,0,0,175.79292104354533,56.96641493953824,,0,0,0,56.96641493953824,33.3592356935065,,0,0,0,33.3592356935065,117.7107732962482,,0,0,0,117.7107732962482
71,PHE,7.13690836002331,,0,0,0,7.13690836002331,4.985612395726496,,0,0,0,4.985612395726496,173.54254312387613,,0,0,0,173.54254312387613,55.77793662419248,,0,0,0,55.77793662419248,41.13537508985459,,0,0,0,41.13537508985459,114.52143762374293,,0,0,0,114.52143762374293
72,ARG,8.798124216405817,,0,0,0,8.798124216405817,4.568215018292818,,0,0,0,4.568215018292818,175.62757352726717,,0,0,0,175.62757352726717,54.13878411131091,,0,0,0,54.13878411131091,33.27831527924298,,0,0,0,33.27831527924298,119.8170870465479,,0,0,0,119.8170870465479
73,GLU,8.589604486069486,,0,0,0,8.589604486069486,3.874968695515595,,0,0,0,3.874968695515595,177.30325263031412,,0,0,0,177.30325263031412,58.701617753679656,,0,0,0,58.701617753679656,29.387115147857696,,0,0,0,29.387115147857696,120.54013288766234,,0,0,0,120.54013288766234
74,GLY,9.095490076689977,,0,0,0,9.095490076689977,4.027100576473526,,0,0,0,4.027100576473526,174.909488447558,,0,0,0,174.909488447558,44.93079568140193,,0,0,0,44.93079568140193,,,0,0,0,,113.94052235488401,,0,0,0,113.94052235488401
75,ASP,8.080153128621378,,0,0,0,8.080153128621378,4.691560692771118,,0,0,0,4.691560692771118,175.49895735082697,,0,0,0,175.49895735082697,55.40373899112554,,0,0,0,55.40373899112554,41.16884334740815,,0,0,0,41.16884334740815,122.74301865701521,,0,0,0,122.74301865701521
76,VAL,8.641932996359195,,0,0,0,8.641932996359195,4.3767730964979465,,0,0,0,4.3767730964979465,175.46139293835054,,0,0,0,175.46139293835054,61.94267285524476,,0,0,0,61.94267285524476,32.11918167179487,,0,0,0,32.11918167179487,121.87524795869686,,0,0,0,121.87524795869686
77,ILE,9.204902954001554,,0,0,0,9.204902954001554,5.125954597630148,,0,0,0,5.125954597630148,173.56794971830948,,0,0,0,173.56794971830948,58.26190969365079,,0,0,0,58.26190969365079,41.551569095587745,,0,0,0,41.551569095587745,123.1917485374015,,0,0,0,123.1917485374015
78,ARG,8.97410266854257,,0,0,0,8.97410266854257,5.241198932217783,,0,0,0,5.241198932217783,174.89836523127985,,0,0,0,174.89836523127985,54.83763493897214,,0,0,0,54.83763493897214,32.99456407132312,,0,0,0,32.99456407132312,124.00502584205795,,0,0,0,124.00502584205795
79,ILE,9.3288897500666,,0,0,0,9.3288897500666,4.858509416183816,,0,0,0,4.858509416183816,175.26007462085693,,0,0,0,175.26007462085693,60.259229133089136,,0,0,0,60.259229133089136,39.00678867139527,,0,0,0,39.00678867139527,126.8559816519647,,0,0,0,126.8559816519647
80,LYS,8.87374901123321,,0,0,0,8.87374901123321,4.695439183904984,,0,0,0,4.695439183904984,175.6924274464702,,0,0,0,175.6924274464702,55.020148239998896,,0,0,0,55.020148239998896,34.81644505888556,,0,0,0,34.81644505888556,127.53592646915862,,0,0,0,127.53592646915862
81,ASP,8.68007546057276,,0,0,0,8.68007546057276,4.471973907728382,,0,0,0,4.471973907728382,175.5436209022755,,0,0,0,175.5436209022755,55.3476821024198,,0,0,0,55.3476821024198,39.76569745989011,,0,0,0,39.76569745989011,119.06948512912643,,0,0,0,119.06948512912643
82,VAL,7.993808562332112,,0,0,0,7.993808562332112,4.972953116855368,,0,0,0,4.972953116855368,174.15530500096017,,0,0,0,174.15530500096017,59.21349355885226,,0,0,0,59.21349355885226,34.306889652308804,,0,0,0,34.306889652308804,116.76733037428683,,0,0,0,116.76733037428683
83,ASN,8.870223036086136,,0,0,0,8.870223036086136,5.327761411910314,,0,0,0,5.327761411910314,174.82480102481406,,0,0,0,174.82480102481406,52.046039483116886,,0,0,0,52.046039483116886,40.469200129270725,,0,0,0,40.469200129270725,122.2931054509546,,0,0,0,122.2931054509546
84,ILE,9.17860055999556,,0,0,0,9.17860055999556,4.825808361366412,,0,0,0,4.825808361366412,175.7127954035076,,0,0,0,175.7127954035076,60.183779332478636,,0,0,0,60.183779332478636,37.64837389102009,,0,0,0,37.64837389102009,126.59206437784994,,0,0,0,126.59206437784994
85,ARG,9.013944186907537,,0,0,0,9.013944186907537,4.870680143023643,,0,0,0,4.870680143023643,175.21004207193363,,0,0,0,175.21004207193363,53.95143341087246,,0,0,0,53.95143341087246,33.95102235118215,,0,0,0,33.95102235118215,127.03986667073482,,0,0,0,127.03986667073482
86,GLY,8.581322886258187,,0,0,0,8.581322886258187,3.9861640381202132,,0,0,0,3.9861640381202132,174.52911451472417,,0,0,0,174.52911451472417,45.87899921364746,,0,0,0,45.87899921364746,,,0,0,0,,110.23190932510268,,0,0,0,110.23190932510268
87,GLY,8.687375726984127,,0,0,0,8.687375726984127,4.103338178027528,,0,0,0,4.103338178027528,174.04814368135197,,0,0,0,174.04814368135197,44.127612714380064,,0,0,0,44.127612714380064,,,0,0,0,,112.14384929545454,,0,0,0,112.14384929545454
88,PHE,8.779585452708403,,0,0,0,8.779585452708403,4.29756524493562,,0,0,0,4.29756524493562,176.75171386190476,,0,0,0,176.75171386190476,58.99765959434455,,0,0,0,58.99765959434455,39.355778293389946,,0,0,0,39.355778293389946,120.68544145887445,,0,0,0,120.68544145887445
89,GLY,8.164991264679765,,0,0,0,8.164991264679765,3.7073284455655457,,0,0,0,3.7073284455655457,175.2358642241481,,0,0,0,175.2358642241481,45.87759717981463,,0,0,0,45.87759717981463,,,0,0,0,,112.8685961544622,,0,0,0,112.8685961544622