RESNUM,RESNAME,H_X,H_Y,H_BEST_REF_SCORE,H_BEST_REF_COV,H_BEST_REF_MATCH,H_UCBShift,HA_X,HA_Y,HA_BEST_REF_SCORE,HA_BEST_REF_COV,HA_BEST_REF_MATCH,HA_UCBShift,C_X,C_Y,C_BEST_REF_SCORE,C_BEST_REF_COV,C_BEST_REF_MATCH,C_UCBShift,CA_X,CA_Y,CA_BEST_REF_SCORE,CA_BEST_REF_COV,CA_BEST_REF_MATCH,CA_UCBShift,CB_X,CB_Y,CB_BEST_REF_SCORE,CB_BEST_REF_COV,CB_BEST_REF_MATCH,CB_UCBShift,N_X,N_Y,N_BEST_REF_SCORE,N_BEST_REF_COV,N_BEST_REF_MATCH,N_UCBShift
1,GLY,8.383414575308025,,0,0,0,8.383414575308025,3.915471536310912,,0,0,0,3.915471536310912,173.92639095349097,,0,0,0,173.92639095349097,44.94181250337996,,0,0,0,44.94181250337996,,,0,0,0,,109.74470416343657,,0,0,0,109.74470416343657
2,HIS,8.453355085375735,,0,0,0,8.453355085375735,4.455809177694528,,0,0,0,4.455809177694528,174.53519262569097,,0,0,0,174.53519262569097,56.023175153230106,,0,0,0,56.023175153230106,30.087079292357643,,0,0,0,30.087079292357643,119.67407589130869,,0,0,0,119.67407589130869
3,HIS,8.595686813908314,,0,0,0,8.595686813908314,4.521978973065823,,0,0,0,4.521978973065823,173.98257616048951,,0,0,0,173.98257616048951,55.39375560836386,,0,0,0,55.39375560836386,29.411357904312354,,0,0,0,29.411357904312354,121.16843830041071,,0,0,0,121.16843830041071
4,HIS,8.560255361072262,,0,0,0,8.560255361072262,4.487208465417915,,0,0,0,4.487208465417915,174.66446594199132,,0,0,0,174.66446594199132,56.07927210496725,,0,0,0,56.07927210496725,29.964915652697304,,0,0,0,29.964915652697304,120.69111160967367,,0,0,0,120.69111160967367
5,HIS,8.562874125407925,,0,0,0,8.562874125407925,4.532846633005883,,0,0,0,4.532846633005883,174.577222015984,,0,0,0,174.577222015984,55.30021753125763,,0,0,0,55.30021753125763,30.58031244983905,,0,0,0,30.58031244983905,120.59575963377179,,0,0,0,120.59575963377179
6,HIS,8.51788473030858,,0,0,0,8.51788473030858,4.369775356304806,,0,0,0,4.369775356304806,174.74745693498724,,0,0,0,174.74745693498724,56.61427175596071,,0,0,0,56.61427175596071,30.107438555078254,,0,0,0,30.107438555078254,120.7191257979576,,0,0,0,120.7191257979576
7,HIS,8.58848987055722,,0,0,0,8.58848987055722,4.422903563431013,,0,0,0,4.422903563431013,175.15534001411922,,0,0,0,175.15534001411922,56.148746187945385,,0,0,0,56.148746187945385,30.10396736924187,,0,0,0,30.10396736924187,121.60567198721279,,0,0,0,121.60567198721279
8,LEU,8.352832807170607,,0,0,0,8.352832807170607,4.25529093489011,,0,0,0,4.25529093489011,177.12294308079697,,0,0,0,177.12294308079697,55.115024290764794,,0,0,0,55.115024290764794,42.20219453926629,,0,0,0,42.20219453926629,123.89422082110667,,0,0,0,123.89422082110667
9,GLU,8.469596749062049,,0,0,0,8.469596749062049,4.392696642612942,,0,0,0,4.392696642612942,176.3245594099012,,0,0,0,176.3245594099012,56.81030395883561,,0,0,0,56.81030395883561,30.19198808187923,,0,0,0,30.19198808187923,123.23645096277612,,0,0,0,123.23645096277612
10,ASP,8.289084423443224,,0,0,0,8.289084423443224,4.753648571631147,,0,0,0,4.753648571631147,174.2185899757409,,0,0,0,174.2185899757409,52.08338292410923,,0,0,0,52.08338292410923,41.13277342957043,,0,0,0,41.13277342957043,122.8234683967033,,0,0,0,122.8234683967033
11,PRO,,,0,0,0,,4.472250206537907,,0,0,0,4.472250206537907,177.0553035238595,,0,0,0,177.0553035238595,63.25267185137085,,0,0,0,63.25267185137085,31.869331960866912,,0,0,0,31.869331960866912,,,0,0,0,
12,SER,8.470602742402043,,0,0,0,8.470602742402043,4.364354281873681,,0,0,0,4.364354281873681,174.97311094163058,,0,0,0,174.97311094163058,58.21893446193806,,0,0,0,58.21893446193806,63.32139865939061,,0,0,0,63.32139865939061,116.84454712200578,,0,0,0,116.84454712200578
13,GLY,8.458476577916528,,0,0,0,8.458476577916528,3.888465250024976,,0,0,0,3.888465250024976,174.15966277708404,,0,0,0,174.15966277708404,45.64636931574537,,0,0,0,45.64636931574537,,,0,0,0,,109.27463939517705,,0,0,0,109.27463939517705
14,GLY,8.036022193906094,,0,0,0,8.036022193906094,4.039485543983793,,0,0,0,4.039485543983793,173.38029250585527,,0,0,0,173.38029250585527,44.95010807187812,,0,0,0,44.95010807187812,,,0,0,0,,108.65783676893662,,0,0,0,108.65783676893662
15,THR,8.066982544116994,,0,0,0,8.066982544116994,4.422641479104229,,0,0,0,4.422641479104229,173.70317801924742,,0,0,0,173.70317801924742,59.77399812772782,,0,0,0,59.77399812772782,69.98727091237652,,0,0,0,69.98727091237652,116.69336946768787,,0,0,0,116.69336946768787
16,PRO,,,0,0,0,,4.198640267654568,,0,0,0,4.198640267654568,175.74817811487958,,0,0,0,175.74817811487958,64.12850820268065,,0,0,0,64.12850820268065,31.29399339131979,,0,0,0,31.29399339131979,,,0,0,0,
17,TYR,7.637164562182261,,0,0,0,7.637164562182261,5.029193393373293,,0,0,0,5.029193393373293,176.19417010494507,,0,0,0,176.19417010494507,57.47572963095238,,0,0,0,57.47572963095238,39.04770892073482,,0,0,0,39.04770892073482,116.07126269395049,,0,0,0,116.07126269395049
18,ILE,7.815407031185481,,0,0,0,7.815407031185481,3.5407169048867813,,0,0,0,3.5407169048867813,176.95226302574648,,0,0,0,176.95226302574648,62.8235647021201,,0,0,0,62.8235647021201,36.02103493494283,,0,0,0,36.02103493494283,120.80650248291154,,0,0,0,120.80650248291154
19,GLY,8.976626074220224,,0,0,0,8.976626074220224,4.033573777267177,,0,0,0,4.033573777267177,174.96405430030526,,0,0,0,174.96405430030526,45.225204738333886,,0,0,0,45.225204738333886,,,0,0,0,,116.2523528980464,,0,0,0,116.2523528980464
20,SER,8.29275175930181,,0,0,0,8.29275175930181,4.537400162631812,,0,0,0,4.537400162631812,173.791080291231,,0,0,0,173.791080291231,59.633620305305804,,0,0,0,59.633620305305804,64.92821636845376,,0,0,0,64.92821636845376,117.60015499892884,,0,0,0,117.60015499892884
21,LYS,8.525456917798866,,0,0,0,8.525456917798866,4.791649750449551,,0,0,0,4.791649750449551,175.68822222881008,,0,0,0,175.68822222881008,56.19839013759574,,0,0,0,56.19839013759574,33.296286801615054,,0,0,0,33.296286801615054,125.27364651335887,,0,0,0,125.27364651335887
22,ILE,9.247461052664,,0,0,0,9.247461052664,4.881121443872794,,0,0,0,4.881121443872794,174.43658132886557,,0,0,0,174.43658132886557,59.9592146985459,,0,0,0,59.9592146985459,40.41433527036852,,0,0,0,40.41433527036852,128.10118156568433,,0,0,0,128.10118156568433
23,SER,8.893948857142858,,0,0,0,8.893948857142858,5.292614219585969,,0,0,0,5.292614219585969,173.43866623340548,,0,0,0,173.43866623340548,56.95765805318015,,0,0,0,56.95765805318015,63.936877787173934,,0,0,0,63.936877787173934,121.76644748041403,,0,0,0,121.76644748041403
24,LEU,9.219533582650683,,0,0,0,9.219533582650683,4.906926906293707,,0,0,0,4.906926906293707,174.6574958247086,,0,0,0,174.6574958247086,53.64275242784438,,0,0,0,53.64275242784438,45.55670197640138,,0,0,0,45.55670197640138,128.84598195315795,,0,0,0,128.84598195315795
25,ILE,9.13109163094683,,0,0,0,9.13109163094683,5.043782437801088,,0,0,0,5.043782437801088,175.8327966276113,,0,0,0,175.8327966276113,59.99677065929071,,0,0,0,59.99677065929071,38.744279747224994,,0,0,0,38.744279747224994,127.00147212510268,,0,0,0,127.00147212510268
26,SER,9.05249326032856,,0,0,0,9.05249326032856,4.997135881374181,,0,0,0,4.997135881374181,176.9669924531635,,0,0,0,176.9669924531635,57.22983111748806,,0,0,0,57.22983111748806,65.2572683039072,,0,0,0,65.2572683039072,123.6314383536741,,0,0,0,123.6314383536741
27,LYS,9.0188532526862,,0,0,0,9.0188532526862,4.101125393167943,,0,0,0,4.101125393167943,177.29425248756797,,0,0,0,177.29425248756797,58.72726973373849,,0,0,0,58.72726973373849,32.385890631285385,,0,0,0,32.385890631285385,121.56225365952382,,0,0,0,121.56225365952382
28,ALA,7.8520602935064945,,0,0,0,7.8520602935064945,4.365169452949829,,0,0,0,4.365169452949829,177.46060439451105,,0,0,0,177.46060439451105,52.09576598196803,,0,0,0,52.09576598196803,18.870218443661894,,0,0,0,18.870218443661894,119.66886698162948,,0,0,0,119.66886698162948
29,GLU,8.127616791802641,,0,0,0,8.127616791802641,3.715065708671885,,0,0,0,3.715065708671885,174.9164425224109,,0,0,0,174.9164425224109,57.91872819811855,,0,0,0,57.91872819811855,26.414085575180373,,0,0,0,26.414085575180373,115.33483267570207,,0,0,0,115.33483267570207
30,ILE,7.4810558721667215,,0,0,0,7.4810558721667215,4.261817606254857,,0,0,0,4.261817606254857,175.32763101223222,,0,0,0,175.32763101223222,60.89807143269508,,0,0,0,60.89807143269508,38.79972039593184,,0,0,0,38.79972039593184,119.18294039734155,,0,0,0,119.18294039734155
31,ARG,8.066430437612388,,0,0,0,8.066430437612388,4.723214184465534,,0,0,0,4.723214184465534,174.45514294896216,,0,0,0,174.45514294896216,55.543839214607615,,0,0,0,55.543839214607615,31.691968347829945,,0,0,0,31.691968347829945,127.70877637890443,,0,0,0,127.70877637890443
32,TYR,9.317102253785103,,0,0,0,9.317102253785103,5.610729953108005,,0,0,0,5.610729953108005,175.225549503552,,0,0,0,175.225549503552,56.36463465959041,,0,0,0,56.36463465959041,40.63261393862249,,0,0,0,40.63261393862249,126.68142502581307,,0,0,0,126.68142502581307
33,GLU,9.07594168976579,,0,0,0,9.07594168976579,5.434887383283383,,0,0,0,5.434887383283383,175.8867938901432,,0,0,0,175.8867938901432,54.76088832400932,,0,0,0,54.76088832400932,32.604529295593295,,0,0,0,32.604529295593295,121.92031751008436,,0,0,0,121.92031751008436
34,GLY,9.341851540703741,,0,0,0,9.341851540703741,4.2486982246170495,,0,0,0,4.2486982246170495,171.97039832779998,,0,0,0,171.97039832779998,45.988736775974026,,0,0,0,45.988736775974026,,,0,0,0,,111.13384309541014,,0,0,0,111.13384309541014
35,ILE,9.093233457437009,,0,0,0,9.093233457437009,4.931063395060495,,0,0,0,4.931063395060495,175.7140966985681,,0,0,0,175.7140966985681,58.83095104191364,,0,0,0,58.83095104191364,37.821837436618935,,0,0,0,37.821837436618935,120.61318726532357,,0,0,0,120.61318726532357
36,LEU,9.183630815384616,,0,0,0,9.183630815384616,4.40029473996559,,0,0,0,4.40029473996559,175.11559683230104,,0,0,0,175.11559683230104,56.46546612827173,,0,0,0,56.46546612827173,42.55080986641136,,0,0,0,42.55080986641136,128.51195672403708,,0,0,0,128.51195672403708
37,TYR,9.193465194322345,,0,0,0,9.193465194322345,4.760009079342879,,0,0,0,4.760009079342879,175.71325894250194,,0,0,0,175.71325894250194,58.82032192430347,,0,0,0,58.82032192430347,39.80842044181929,,0,0,0,39.80842044181929,131.27470758398823,,0,0,0,131.27470758398823
38,THR,8.032862018276168,,0,0,0,8.032862018276168,4.719059697324897,,0,0,0,4.719059697324897,172.0281657993229,,0,0,0,172.0281657993229,60.6427618014208,,0,0,0,60.6427618014208,70.1841925011544,,0,0,0,70.1841925011544,110.01050798413807,,0,0,0,110.01050798413807
39,ILE,8.55562524870685,,0,0,0,8.55562524870685,4.654459118781219,,0,0,0,4.654459118781219,174.45601401807636,,0,0,0,174.45601401807636,60.33310658626929,,0,0,0,60.33310658626929,40.478000860989006,,0,0,0,40.478000860989006,122.32996703383839,,0,0,0,122.32996703383839
40,ASP,8.832200656338106,,0,0,0,8.832200656338106,5.000098567715618,,0,0,0,5.000098567715618,176.97295959659786,,0,0,0,176.97295959659786,52.587748854517706,,0,0,0,52.587748854517706,41.809447711433016,,0,0,0,41.809447711433016,128.34547875171495,,0,0,0,128.34547875171495
41,THR,8.763352617726719,,0,0,0,8.763352617726719,4.278471063958264,,0,0,0,4.278471063958264,175.78868851867577,,0,0,0,175.78868851867577,64.15347621951382,,0,0,0,64.15347621951382,68.98741541874791,,0,0,0,68.98741541874791,117.69532013084137,,0,0,0,117.69532013084137
42,GLU,8.344484328171829,,0,0,0,8.344484328171829,4.158567466022866,,0,0,0,4.158567466022866,177.63420383939393,,0,0,0,177.63420383939393,58.617372516000664,,0,0,0,58.617372516000664,29.886023853762904,,0,0,0,29.886023853762904,122.07659090870796,,0,0,0,122.07659090870796
43,ASN,8.301614324936175,,0,0,0,8.301614324936175,4.795355487029637,,0,0,0,4.795355487029637,174.64759396797646,,0,0,0,174.64759396797646,53.040979044594295,,0,0,0,53.040979044594295,38.93743408889999,,0,0,0,38.93743408889999,114.84366245239205,,0,0,0,114.84366245239205
44,SER,8.027997983161283,,0,0,0,8.027997983161283,4.08055287014652,,0,0,0,4.08055287014652,173.30086574060383,,0,0,0,173.30086574060383,58.826310167155064,,0,0,0,58.826310167155064,61.79722470542235,,0,0,0,61.79722470542235,114.78450273933844,,0,0,0,114.78450273933844
45,THR,8.145394961455212,,0,0,0,8.145394961455212,5.149209891569541,,0,0,0,5.149209891569541,173.73745999834054,,0,0,0,173.73745999834054,60.63707151783216,,0,0,0,60.63707151783216,71.33106781470751,,0,0,0,71.33106781470751,112.26379515203685,,0,0,0,112.26379515203685
46,VAL,9.215830389088689,,0,0,0,9.215830389088689,4.510759155106005,,0,0,0,4.510759155106005,174.25810533503164,,0,0,0,174.25810533503164,61.47962353076923,,0,0,0,61.47962353076923,34.09431380972916,,0,0,0,34.09431380972916,124.17936825920191,,0,0,0,124.17936825920191
47,ALA,9.21875178061383,,0,0,0,9.21875178061383,4.86781685966256,,0,0,0,4.86781685966256,176.02519412191143,,0,0,0,176.02519412191143,49.80390713417138,,0,0,0,49.80390713417138,20.025996783527585,,0,0,0,20.025996783527585,131.04826541398046,,0,0,0,131.04826541398046
48,LEU,8.905610756404707,,0,0,0,8.905610756404707,5.242054444633146,,0,0,0,5.242054444633146,175.48829773528138,,0,0,0,175.48829773528138,53.029400648246195,,0,0,0,53.029400648246195,44.536959615639915,,0,0,0,44.536959615639915,124.40243282935953,,0,0,0,124.40243282935953
49,ALA,9.290305304040404,,0,0,0,9.290305304040404,5.264530271711623,,0,0,0,5.264530271711623,176.93819578669664,,0,0,0,176.93819578669664,50.379210385209234,,0,0,0,50.379210385209234,21.26096342011322,,0,0,0,21.26096342011322,124.6355157459041,,0,0,0,124.6355157459041
50,LYS,9.007090377478077,,0,0,0,9.007090377478077,4.084860851806527,,0,0,0,4.084860851806527,175.79598619725274,,0,0,0,175.79598619725274,57.06902091324231,,0,0,0,57.06902091324231,30.488733153224555,,0,0,0,30.488733153224555,118.91855388396048,,0,0,0,118.91855388396048
51,VAL,8.785899702475302,,0,0,0,8.785899702475302,4.713074076018426,,0,0,0,4.713074076018426,175.22305919733046,,0,0,0,175.22305919733046,61.63466421580642,,0,0,0,61.63466421580642,32.39489914287379,,0,0,0,32.39489914287379,120.3243112043956,,0,0,0,120.3243112043956
52,ARG,9.256164063580863,,0,0,0,9.256164063580863,5.157199934532134,,0,0,0,5.157199934532134,175.22782681388614,,0,0,0,175.22782681388614,54.60258878565878,,0,0,0,54.60258878565878,32.89298527787768,,0,0,0,32.89298527787768,129.07227901270397,,0,0,0,129.07227901270397
53,SER,8.545526834848486,,0,0,0,8.545526834848486,4.883758703496503,,0,0,0,4.883758703496503,174.9695021047508,,0,0,0,174.9695021047508,57.03477850722055,,0,0,0,57.03477850722055,64.25479621243755,,0,0,0,64.25479621243755,120.53272597234988,,0,0,0,120.53272597234988
54,PHE,8.967234839821291,,0,0,0,8.967234839821291,4.38134842000777,,0,0,0,4.38134842000777,176.29840515591076,,0,0,0,176.29840515591076,58.72123274753025,,0,0,0,58.72123274753025,39.24639316173826,,0,0,0,39.24639316173826,123.124949909657,,0,0,0,123.124949909657
55,GLY,7.710675053801753,,0,0,0,7.710675053801753,3.9521175200965697,,0,0,0,3.9521175200965697,174.73948771989123,,0,0,0,174.73948771989123,46.35779498175158,,0,0,0,46.35779498175158,,,0,0,0,,108.6537486966589,,0,0,0,108.6537486966589
56,THR,8.549914206526807,,0,0,0,8.549914206526807,4.507303933355534,,0,0,0,4.507303933355534,175.15774389286824,,0,0,0,175.15774389286824,61.703035351665,,0,0,0,61.703035351665,69.0908729938728,,0,0,0,69.0908729938728,113.68378628460982,,0,0,0,113.68378628460982
57,GLU,8.17830854008214,,0,0,0,8.17830854008214,3.963719594094794,,0,0,0,3.963719594094794,176.03910995786435,,0,0,0,176.03910995786435,57.673952218370516,,0,0,0,57.673952218370516,27.64550431239316,,0,0,0,27.64550431239316,120.29156436370296,,0,0,0,120.29156436370296
58,ASP,8.431432052314353,,0,0,0,8.431432052314353,4.487725801032301,,0,0,0,4.487725801032301,175.92929776285382,,0,0,0,175.92929776285382,55.435471704489956,,0,0,0,55.435471704489956,40.18487939036519,,0,0,0,40.18487939036519,111.3114444927295,,0,0,0,111.3114444927295
59,ARG,7.816907479631479,,0,0,0,7.816907479631479,4.558962888336664,,0,0,0,4.558962888336664,174.56942883958263,,0,0,0,174.56942883958263,54.57847233010878,,0,0,0,54.57847233010878,29.856437555217006,,0,0,0,29.856437555217006,120.99247328681318,,0,0,0,120.99247328681318
60,PRO,,,0,0,0,,4.465016264552115,,0,0,0,4.465016264552115,176.32849975477856,,0,0,0,176.32849975477856,62.95903067297147,,0,0,0,62.95903067297147,31.554664935664338,,0,0,0,31.554664935664338,,,0,0,0,
61,THR,7.998552060328561,,0,0,0,7.998552060328561,4.486692040478966,,0,0,0,4.486692040478966,174.07338995019978,,0,0,0,174.07338995019978,60.81353643679098,,0,0,0,60.81353643679098,70.44003384276279,,0,0,0,70.44003384276279,115.50575832375402,,0,0,0,115.50575832375402
62,ASP,8.541751912703964,,0,0,0,8.541751912703964,4.4995819978826725,,0,0,0,4.4995819978826725,176.2435881436508,,0,0,0,176.2435881436508,55.23492343761794,,0,0,0,55.23492343761794,40.89889120441781,,0,0,0,40.89889120441781,123.0303484583472,,0,0,0,123.0303484583472
63,ARG,8.09227079139749,,0,0,0,8.09227079139749,4.761120500604951,,0,0,0,4.761120500604951,173.88783266936397,,0,0,0,173.88783266936397,53.16019467515817,,0,0,0,53.16019467515817,31.067672584948383,,0,0,0,31.067672584948383,119.3561565924631,,0,0,0,119.3561565924631
64,PRO,,,0,0,0,,4.4313323341547335,,0,0,0,4.4313323341547335,176.64151595481187,,0,0,0,176.64151595481187,62.99640542988678,,0,0,0,62.99640542988678,32.01238447200577,,0,0,0,32.01238447200577,,,0,0,0,
65,ILE,8.292498916022867,,0,0,0,8.292498916022867,4.25222234021534,,0,0,0,4.25222234021534,175.3027374544844,,0,0,0,175.3027374544844,60.605456186335886,,0,0,0,60.605456186335886,38.72100007422022,,0,0,0,38.72100007422022,123.27190822299367,,0,0,0,123.27190822299367
66,ALA,8.343196232467532,,0,0,0,8.343196232467532,4.4659949325369075,,0,0,0,4.4659949325369075,175.2776100838162,,0,0,0,175.2776100838162,50.211889666960815,,0,0,0,50.211889666960815,17.972977340132093,,0,0,0,17.972977340132093,132.06379917130093,,0,0,0,132.06379917130093
67,PRO,,,0,0,0,,4.342134535545011,,0,0,0,4.342134535545011,176.68029760831948,,0,0,0,176.68029760831948,63.07483567620157,,0,0,0,63.07483567620157,31.81240362665668,,0,0,0,31.81240362665668,,,0,0,0,
68,ARG,8.382657408491509,,0,0,0,8.382657408491509,4.433979016688866,,0,0,0,4.433979016688866,176.17945295784773,,0,0,0,176.17945295784773,55.47470508359418,,0,0,0,55.47470508359418,30.895562513020312,,0,0,0,30.895562513020312,123.39120206974137,,0,0,0,123.39120206974137
69,ASP,8.481233215545565,,0,0,0,8.481233215545565,4.438271057731157,,0,0,0,4.438271057731157,175.71040324824065,,0,0,0,175.71040324824065,54.50238335056055,,0,0,0,54.50238335056055,40.69959115762016,,0,0,0,40.69959115762016,123.15108317923743,,0,0,0,123.15108317923743
70,GLU,8.160325292973694,,0,0,0,8.160325292973694,4.218882413625263,,0,0,0,4.218882413625263,175.0909794162504,,0,0,0,175.0909794162504,56.60989768012543,,0,0,0,56.60989768012543,30.025058965834166,,0,0,0,30.025058965834166,120.74850866753246,,0,0,0,120.74850866753246
71,THR,8.116466564657564,,0,0,0,8.116466564657564,4.837429892107892,,0,0,0,4.837429892107892,174.30844647432565,,0,0,0,174.30844647432565,61.81663898450993,,0,0,0,61.81663898450993,69.42070892651792,,0,0,0,69.42070892651792,121.29802485140414,,0,0,0,121.29802485140414
72,PHE,9.278703521339771,,0,0,0,9.278703521339771,4.632411427677877,,0,0,0,4.632411427677877,175.8301478688645,,0,0,0,175.8301478688645,57.28540775871906,,0,0,0,57.28540775871906,40.20571236153847,,0,0,0,40.20571236153847,128.247816494339,,0,0,0,128.247816494339
73,GLU,8.991689053596403,,0,0,0,8.991689053596403,4.243368918714618,,0,0,0,4.243368918714618,176.54158496201575,,0,0,0,176.54158496201575,58.702516875463424,,0,0,0,58.702516875463424,30.002627091314242,,0,0,0,30.002627091314242,123.48056422743923,,0,0,0,123.48056422743923
74,TYR,7.936175773459873,,0,0,0,7.936175773459873,5.44613050066045,,0,0,0,5.44613050066045,173.68183581408036,,0,0,0,173.68183581408036,57.2109835504884,,0,0,0,57.2109835504884,41.16092581260406,,0,0,0,41.16092581260406,118.62108576957486,,0,0,0,118.62108576957486
75,ILE,8.81355076021756,,0,0,0,8.81355076021756,4.48416292042957,,0,0,0,4.48416292042957,173.23151169971695,,0,0,0,173.23151169971695,60.10246282002442,,0,0,0,60.10246282002442,41.31363652964258,,0,0,0,41.31363652964258,126.18460305003886,,0,0,0,126.18460305003886
76,ILE,8.195906876778777,,0,0,0,8.195906876778777,4.432841152908203,,0,0,0,4.432841152908203,175.0477075861472,,0,0,0,175.0477075861472,60.09444242898213,,0,0,0,60.09444242898213,38.37560924290154,,0,0,0,38.37560924290154,125.2096058489344,,0,0,0,125.2096058489344
77,PHE,9.146609597868798,,0,0,0,9.146609597868798,4.619368721905872,,0,0,0,4.619368721905872,175.12913706488513,,0,0,0,175.12913706488513,56.59503325119326,,0,0,0,56.59503325119326,41.30218788149073,,0,0,0,41.30218788149073,127.33018351813742,,0,0,0,127.33018351813742
78,ARG,8.948076515023866,,0,0,0,8.948076515023866,4.623999981318681,,0,0,0,4.623999981318681,177.56369636499056,,0,0,0,177.56369636499056,56.22578101126096,,0,0,0,56.22578101126096,30.90829082112332,,0,0,0,30.90829082112332,123.64396371656122,,0,0,0,123.64396371656122
79,GLY,9.031484334199135,,0,0,0,9.031484334199135,3.945088428862804,,0,0,0,3.945088428862804,175.68853672494174,,0,0,0,175.68853672494174,47.292118940176486,,0,0,0,47.292118940176486,,,0,0,0,,113.0425985583694,,0,0,0,113.0425985583694
80,SER,8.385350595010545,,0,0,0,8.385350595010545,4.308701267371517,,0,0,0,4.308701267371517,175.2293357510767,,0,0,0,175.2293357510767,60.04608243726828,,0,0,0,60.04608243726828,62.89734943800089,,0,0,0,62.89734943800089,114.04178810856921,,0,0,0,114.04178810856921
81,ASP,8.071113395693196,,0,0,0,8.071113395693196,4.844055285076035,,0,0,0,4.844055285076035,175.09488893724054,,0,0,0,175.09488893724054,54.2239649942835,,0,0,0,54.2239649942835,41.58705636283162,,0,0,0,41.58705636283162,120.92748878111888,,0,0,0,120.92748878111888
82,ILE,7.336932271034522,,0,0,0,7.336932271034522,3.950910738644689,,0,0,0,3.950910738644689,175.4438811604229,,0,0,0,175.4438811604229,62.19073034329004,,0,0,0,62.19073034329004,38.28687155404595,,0,0,0,38.28687155404595,120.56264113181264,,0,0,0,120.56264113181264
83,LYS,8.972552119363968,,0,0,0,8.972552119363968,4.339383881629482,,0,0,0,4.339383881629482,176.4511433058608,,0,0,0,176.4511433058608,57.10933891021201,,0,0,0,57.10933891021201,33.72480422517483,,0,0,0,33.72480422517483,129.40158407677322,,0,0,0,129.40158407677322
84,ASP,8.005788865678765,,0,0,0,8.005788865678765,4.878991617776668,,0,0,0,4.878991617776668,174.16797784404486,,0,0,0,174.16797784404486,53.66129018073038,,0,0,0,53.66129018073038,44.29656417925963,,0,0,0,44.29656417925963,117.82439073897214,,0,0,0,117.82439073897214
85,LEU,8.510790364707516,,0,0,0,8.510790364707516,5.0334409227827726,,0,0,0,5.0334409227827726,175.59404229224663,,0,0,0,175.59404229224663,54.40852111069486,,0,0,0,54.40852111069486,44.613567055794206,,0,0,0,44.613567055794206,124.25374475088245,,0,0,0,124.25374475088245
86,THR,9.048266757609058,,0,0,0,9.048266757609058,4.587605072938173,,0,0,0,4.587605072938173,172.90768254456097,,0,0,0,172.90768254456097,61.267633019219666,,0,0,0,61.267633019219666,70.8756764011655,,0,0,0,70.8756764011655,121.57916627302696,,0,0,0,121.57916627302696
87,VAL,8.8235675013542,,0,0,0,8.8235675013542,4.021031596581196,,0,0,0,4.021031596581196,175.06300293120768,,0,0,0,175.06300293120768,63.304047400982355,,0,0,0,63.304047400982355,31.738776216078367,,0,0,0,31.738776216078367,127.32597450567766,,0,0,0,127.32597450567766
88,CYS,8.973889395493396,,0,0,0,8.973889395493396,4.405625890889666,,0,0,0,4.405625890889666,174.49933199297922,,0,0,0,174.49933199297922,59.521471519508275,,0,0,0,59.521471519508275,28.453547603435453,,0,0,0,28.453547603435453,129.24431805050506,,0,0,0,129.24431805050506
89,GLU,7.93436996035631,,0,0,0,7.93436996035631,4.584188028427128,,0,0,0,4.584188028427128,173.50954181667223,,0,0,0,173.50954181667223,53.362560773759576,,0,0,0,53.362560773759576,31.817967709984462,,0,0,0,31.817967709984462,119.68668928018649,,0,0,0,119.68668928018649
90,PRO,,,0,0,0,,4.62260334499667,,0,0,0,4.62260334499667,171.54756904451105,,0,0,0,171.54756904451105,61.444720264152515,,0,0,0,61.444720264152515,30.842933187862137,,0,0,0,30.842933187862137,,,0,0,0,